program: Orca
programVersion: 5.0.2
elementType: Cl O O N N C C C C C C C C C C C C C C C C C C C C C C H H H H H H H H H H H H H H H H H H H H H H H H H
charge: 0
multiplicity: 1
keywords: wb97x-d3
keywords: def2-TZVPP
keywords: def2/J RIJCOSX
keywords: DEFGRID2
keywords: scfconv7
keywords: smallprint printgap noloewdin
keywords: NOSOSCF
formula: C22H25ClN2O2
InChI: InChI=1/C22H25ClN2O2/c1-22(2,3)18-6-4-16(5-7-18)19(17-8-9-24-20(23)14-17)15-21(26)25-10-12-27-13-11-25/h4-9,14-15H,10-13H2,1-3H3
52 atoms
Cl -3.375627 -3.301947 -0.206527
O  -4.68049 1.073815 2.614064
O  -2.444592 1.479066 -1.55825
N  -2.884262 1.913929 0.618506
N  -1.594042 -3.040776 -2.083885
C  5.944007 0.481676 0.334866
C  4.433748 0.51539 0.134343
C  6.25664 0.004616 1.758762
C  6.588169 1.85275 0.13706
C  6.561241 -0.493653 -0.675345
C  -2.49538 1.940108 2.016772
C  -4.31812 2.039422 0.424399
C  3.684339 -0.652027 0.302587
C  3.739865 1.666936 -0.230324
C  -3.292826 0.905186 2.792971
C  -5.038874 0.990212 1.251014
C  1.624363 0.491273 -0.239261
C  0.160252 0.475559 -0.422151
C  2.314172 -0.669896 0.116236
C  2.364603 1.656952 -0.415611
C  -2.058966 1.618724 -0.403215
C  -0.605481 1.518443 -0.078272
C  -0.436446 -0.754128 -0.991798
C  -1.496121 -1.38951 -0.359176
C  0.049497 -1.310838 -2.172983
C  -2.02978 -2.51306 -0.968217
C  -0.561674 -2.443604 -2.674492
H  5.87139 -0.997394 1.953373
H  5.828973 0.676206 2.505873
H  7.336494 -0.026021 1.919973
H  6.438368 2.238915 -0.872993
H  7.66514 1.778298 0.297499
H  6.20736 2.5944 0.841998
H  6.180472 -1.508678 -0.55213
H  7.645797 -0.534762 -0.55194
H  6.356395 -0.184291 -1.702229
H  -1.434024 1.726942 2.130053
H  -2.679039 2.939442 2.423286
H  -4.633403 3.041321 0.732718
H  -4.567031 1.921425 -0.627393
H  4.175179 -1.57573 0.583885
H  4.26599 2.598226 -0.390049
H  -3.085215 1.005965 3.859609
H  -2.981638 -0.102948 2.483316
H  -4.816656 -0.009769 0.852243
H  -6.117324 1.143041 1.187221
H  1.77696 -1.598903 0.263494
H  1.870148 2.5696 -0.725227
H  -0.149664 2.380281 0.39827
H  -1.890285 -1.024957 0.579793
H  0.879469 -0.864053 -2.703187
H  -0.211988 -2.893048 -3.595903
elementType: Cl O N C H
totalener: -1573.67631611 hartree
nucrepener: 2574.58737107 hartree
electener: -4148.26368718 hartree
oneelecener: -7265.57937688 hartree
twoeener: 3117.31568971 hartree
cpcmener: -0.03802054 hartree
kineticenergy: 1568.01119740 hartree
xcener: -130.923625395603 hartree
chargesum: -0.0000000
charge: -0.085766 -0.377118 -0.513417 -0.074687 -0.320748 0.319777 -0.088908 -0.328269 -0.356896 -0.325727 -0.079511 -0.061557 -0.178858 -0.155673 0.013369 0.024150 -0.007882 0.170463 -0.213876 -0.173785 0.247002 -0.184024 -0.004542 -0.169822 -0.163990 0.187373 0.024348 0.097385 0.102680 0.096864 0.100523 0.100387 0.101885 0.097192 0.096634 0.103005 0.115491 0.108547 0.106335 0.096863 0.141000 0.143977 0.104027 0.088816 0.074304 0.102327 0.154286 0.147973 0.152659 0.143445 0.152467 0.149504
qa: -0.0858 -0.3771 -0.5134 -0.0747 -0.3207 0.3198 -0.0889 -0.3283 -0.3569 -0.3257 -0.0795 -0.0616 -0.1789 -0.1557 0.0134 0.0242 -0.0079 0.1705 -0.2139 -0.1738 0.2470 -0.1840 -0.0045 -0.1698 -0.1640 0.1874 0.0243 0.0974 0.1027 0.0969 0.1005 0.1004 0.1019 0.0972 0.0966 0.1030 0.1155 0.1085 0.1063 0.0969 0.1410 0.1440 0.1040 0.0888 0.0743 0.1023 0.1543 0.1480 0.1527 0.1434 0.1525 0.1495
va: 1.2196 1.9339 1.9951 3.1390 3.0495 3.6553 3.7787 3.9183 3.9264 3.9181 3.8739 3.8260 4.0088 3.9204 3.9379 3.9540 3.5589 3.4167 4.0068 4.0147 4.2469 3.7520 3.6241 3.9246 3.9226 4.1905 4.0263 1.0043 1.0033 1.0034 1.0008 1.0070 1.0009 1.0039 1.0034 1.0035 1.0066 1.0074 1.0064 1.0451 1.0037 1.0002 0.9999 1.0002 1.0094 0.9991 0.9945 1.0032 0.9983 1.0007 0.9967 0.9983
dispcorr: -0.027963038 hartree
energy: -1573.704279148591
dipole: 41.82156 -39.54770 2.27386 19.11975 -17.62752 1.49224 11.10381 -9.36484 1.73897
magnitude: 3.22819 au
magnitude: 8.20542 debye
