program: Orca
programVersion: 5.0.2
elementType: Cl O O N N C C C C C C C C C C C C C C C C C C C C C C H H H H H H H H H H H H H H H H H H H H H H H H H
charge: 0
multiplicity: 1
keywords: wb97x-d3
keywords: def2-TZVPP
keywords: def2/J RIJCOSX
keywords: DEFGRID2
keywords: scfconv7
keywords: smallprint printgap noloewdin
keywords: NOSOSCF
formula: C22H25ClN2O2
InChI: InChI=1/C22H25ClN2O2/c1-22(2,3)18-6-4-16(5-7-18)19(17-8-9-24-20(23)14-17)15-21(26)25-10-12-27-13-11-25/h4-9,14-15H,10-13H2,1-3H3
52 atoms
Cl -2.978589 -3.94885 0.270181
O  -4.781903 2.610782 -0.712536
O  -2.25718 0.506019 2.775429
N  -2.858862 1.085532 0.672919
N  -1.814768 -2.860794 -1.78374
C  5.945751 0.735916 -0.241652
C  4.436706 0.618782 -0.061751
C  6.64819 -0.046283 0.875207
C  6.425851 2.185367 -0.18867
C  6.341582 0.148434 -1.601885
C  -2.573896 1.602771 -0.653061
C  -4.278663 0.885236 0.910825
C  3.609013 1.720992 0.138576
C  3.825612 -0.637561 -0.099411
C  -3.406165 2.849124 -0.904983
C  -5.043318 2.157111 0.598084
C  1.638414 0.322533 0.271588
C  0.184651 0.15864 0.472751
C  2.238173 1.578403 0.299678
C  2.45937 -0.786496 0.056893
C  -1.952402 0.827574 1.630643
C  -0.502767 0.950928 1.30431
C  -0.490703 -0.90847 -0.299814
C  -1.308848 -1.843631 0.320703
C  -0.332199 -0.992458 -1.682862
C  -1.939682 -2.780433 -0.483423
C  -1.015438 -1.974541 -2.372766
H  7.732655 0.022727 0.764422
H  6.386911 -1.10558 0.863527
H  6.390287 0.348754 1.859886
H  5.982936 2.796289 -0.977648
H  7.508362 2.219452 -0.323621
H  6.205459 2.659914 0.76957
H  7.42115 0.224871 -1.748959
H  5.856736 0.682797 -2.421364
H  6.075685 -0.906084 -1.690336
H  -1.521529 1.858588 -0.751192
H  -2.808295 0.839358 -1.401812
H  -4.629644 0.067066 0.272522
H  -4.449845 0.596161 1.944667
H  4.020473 2.720682 0.162903
H  4.424105 -1.527238 -0.252799
H  -3.27116 3.173233 -1.938158
H  -3.056794 3.659324 -0.249474
H  -4.785222 2.93095 1.334416
H  -6.11561 1.969359 0.67171
H  1.630413 2.465697 0.428467
H  2.033224 -1.781929 0.027784
H  0.024999 1.685675 1.903441
H  -1.442491 -1.854221 1.393628
H  0.299238 -0.295606 -2.217287
H  -0.921571 -2.055083 -3.448971
elementType: Cl O N C H
totalener: -1573.67554896 hartree
nucrepener: 2582.28688067 hartree
electener: -4155.96242963 hartree
oneelecener: -7280.34706027 hartree
twoeener: 3124.38463064 hartree
cpcmener: -0.03533450 hartree
kineticenergy: 1568.00683683 hartree
xcener: -130.923394442805 hartree
chargesum: 0.0000000
charge: -0.084215 -0.378390 -0.523243 -0.076050 -0.317483 0.319570 -0.090236 -0.327040 -0.357751 -0.325057 -0.083373 -0.055684 -0.161955 -0.178835 0.010618 0.019875 0.005061 0.128004 -0.182469 -0.205595 0.255912 -0.096588 0.023000 -0.195646 -0.184971 0.194252 0.026306 0.096614 0.097042 0.103204 0.101835 0.100130 0.101561 0.096700 0.102102 0.096968 0.120542 0.104341 0.099074 0.098036 0.144292 0.140912 0.101498 0.083670 0.082467 0.100707 0.146652 0.153213 0.130196 0.137686 0.152505 0.150034
qa: -0.0842 -0.3784 -0.5232 -0.0761 -0.3175 0.3196 -0.0902 -0.3270 -0.3578 -0.3251 -0.0834 -0.0557 -0.1620 -0.1788 0.0106 0.0199 0.0051 0.1280 -0.1825 -0.2056 0.2559 -0.0966 0.0230 -0.1956 -0.1850 0.1943 0.0263 0.0966 0.0970 0.1032 0.1018 0.1001 0.1016 0.0967 0.1021 0.0970 0.1205 0.1043 0.0991 0.0980 0.1443 0.1409 0.1015 0.0837 0.0825 0.1007 0.1467 0.1532 0.1302 0.1377 0.1525 0.1500
va: 1.2179 1.9389 1.9767 3.1092 3.0475 3.6554 3.7794 3.9189 3.9270 3.9181 3.8501 3.8199 3.9290 4.0050 3.9920 3.9684 3.5318 3.3957 4.0264 4.0050 4.1991 3.8252 3.5995 3.9374 3.9049 4.1753 4.0268 1.0035 1.0041 1.0034 1.0006 1.0072 1.0006 1.0035 1.0033 1.0043 1.0006 1.0003 1.0089 1.0445 1.0000 1.0035 0.9966 1.0057 1.0038 0.9970 1.0023 0.9951 1.0135 1.0364 0.9993 0.9986
dispcorr: -0.028652703 hartree
energy: -1573.704201665122
dipole: 40.05884 -38.03164 2.02720 26.10503 -24.17836 1.92667 -5.13330 3.66501 -1.46829
magnitude: 3.15872 au
magnitude: 8.02882 debye
