program: Orca
programVersion: 5.0.2
elementType: Cl O O N N C C C C C C C C C C C C C C C C C C C C C C H H H H H H H H H H H H H H H H H H H H H H H H H
charge: 0
multiplicity: 1
keywords: wb97x-d3
keywords: def2-TZVPP
keywords: def2/J RIJCOSX
keywords: DEFGRID2
keywords: scfconv7
keywords: smallprint printgap noloewdin
keywords: NOSOSCF
formula: C22H25ClN2O2
InChI: InChI=1/C22H25ClN2O2/c1-22(2,3)18-6-4-16(5-7-18)19(17-8-9-24-20(23)14-17)15-21(26)25-10-12-27-13-11-25/h4-9,14-15H,10-13H2,1-3H3
52 atoms
Cl -1.068532 -4.182839 -0.765712
O  -4.919725 1.406093 -2.197663
O  -2.498992 2.734368 1.698459
N  -3.044046 1.467214 -0.096135
N  -2.092486 -2.959762 1.287674
C  5.72165 0.350454 -0.274508
C  4.21783 0.485794 -0.065068
C  6.029378 -1.07082 -0.7623
C  6.44954 0.600351 1.051783
C  6.253911 1.340926 -1.308865
C  -2.723017 0.81471 -1.352964
C  -4.470589 1.491679 0.179456
C  3.568391 -0.327507 0.867617
C  3.427816 1.37709 -0.786922
C  -3.537498 1.442153 -2.471008
C  -5.221618 2.08332 -0.997582
C  1.416518 0.636711 0.33643
C  -0.04224 0.710726 0.553474
C  2.201183 -0.260978 1.062899
C  2.055324 1.450604 -0.594318
C  -2.16442 2.051295 0.734777
C  -0.707677 1.869901 0.477572
C  -0.745971 -0.561899 0.833095
C  -0.55719 -1.657499 -0.00229
C  -1.610554 -0.706952 1.915143
C  -1.268021 -2.811313 0.280177
C  -2.255487 -1.916892 2.095328
H  5.524981 -1.284695 -1.706748
H  5.71818 -1.828385 -0.041474
H  7.102567 -1.194465 -0.923318
H  6.147359 -0.102711 1.82919
H  6.261065 1.608939 1.424834
H  7.528063 0.492152 0.917852
H  5.808057 1.190146 -2.293839
H  7.331989 1.212092 -1.420717
H  6.081016 2.378057 -1.014934
H  -1.666448 0.921767 -1.587101
H  -2.946413 -0.254184 -1.279257
H  -4.806889 0.465339 0.361567
H  -4.670232 2.072364 1.07639
H  4.134966 -1.037474 1.457431
H  3.870682 2.025415 -1.530516
H  -3.371986 0.889301 -3.397153
H  -3.200432 2.476059 -2.629869
H  -4.98415 3.152591 -1.085505
H  -6.29635 1.99214 -0.832064
H  1.744317 -0.910268 1.79967
H  1.477169 2.13816 -1.199673
H  -0.158602 2.794101 0.332676
H  0.107097 -1.606055 -0.853898
H  -1.771186 0.096755 2.620418
H  -2.932196 -2.056014 2.92963
elementType: Cl O N C H
totalener: -1573.67523356 hartree
nucrepener: 2588.09419895 hartree
electener: -4161.76943250 hartree
oneelecener: -7291.81471306 hartree
twoeener: 3130.04528055 hartree
cpcmener: -0.03471118 hartree
kineticenergy: 1568.01938040 hartree
xcener: -130.925818430764 hartree
chargesum: -0.0000000
charge: -0.086547 -0.378028 -0.524136 -0.074731 -0.317324 0.318493 -0.088056 -0.324418 -0.327294 -0.356552 -0.082670 -0.057088 -0.177524 -0.165261 0.008597 0.020759 0.006688 0.123038 -0.208589 -0.178278 0.255868 -0.099612 0.027360 -0.222743 -0.166228 0.202069 0.024520 0.102598 0.096924 0.096676 0.096672 0.102761 0.096858 0.099691 0.099923 0.102752 0.120344 0.105784 0.099275 0.097960 0.141422 0.144499 0.101775 0.084794 0.082619 0.100519 0.154083 0.146175 0.131386 0.142820 0.147865 0.151511
qa: -0.0865 -0.3780 -0.5241 -0.0747 -0.3173 0.3185 -0.0881 -0.3244 -0.3273 -0.3566 -0.0827 -0.0571 -0.1775 -0.1653 0.0086 0.0208 0.0067 0.1230 -0.2086 -0.1783 0.2559 -0.0996 0.0274 -0.2227 -0.1662 0.2021 0.0245 0.1026 0.0969 0.0967 0.0967 0.1028 0.0969 0.0997 0.0999 0.1028 0.1203 0.1058 0.0993 0.0980 0.1414 0.1445 0.1018 0.0848 0.0826 0.1005 0.1541 0.1462 0.1314 0.1428 0.1479 0.1515
va: 1.2154 1.9384 1.9757 3.0991 3.0476 3.6570 3.7779 3.9183 3.9187 3.9264 3.8457 3.8191 4.0021 3.9329 3.9935 3.9669 3.5339 3.3990 4.0037 4.0219 4.2054 3.8230 3.6015 3.9484 3.8986 4.1555 4.0306 1.0037 1.0042 1.0035 1.0047 1.0035 1.0032 1.0010 1.0072 1.0007 1.0013 0.9986 1.0090 1.0440 1.0032 1.0000 0.9965 1.0056 1.0037 0.9969 0.9943 1.0028 1.0137 1.0140 1.0187 0.9981
dispcorr: -0.028706370 hartree
energy: -1573.703939927236
dipole: 31.55620 -30.11134 1.44486 20.24092 -19.56157 0.67936 -5.33845 4.22598 -1.11247
magnitude: 1.94595 au
magnitude: 4.94622 debye
