program: Orca
programVersion: 5.0.2
elementType: Cl O O N N C C C C C C C C C C C C C C C C C C C C C C H H H H H H H H H H H H H H H H H H H H H H H H H
charge: 0
multiplicity: 1
keywords: wb97x-d3
keywords: def2-TZVPP
keywords: def2/J RIJCOSX
keywords: DEFGRID2
keywords: scfconv7
keywords: smallprint printgap noloewdin
keywords: NOSOSCF
formula: C22H25ClN2O2
InChI: InChI=1/C22H25ClN2O2/c1-22(2,3)18-6-4-16(5-7-18)19(17-8-9-24-20(23)14-17)15-21(26)25-10-12-27-13-11-25/h4-9,14-15H,10-13H2,1-3H3
52 atoms
Cl -3.139011 -2.403574 -2.980439
O  -4.677688 3.567366 0.832075
O  -2.49246 -0.668464 1.832657
N  -3.032116 1.290621 0.838567
N  -1.356756 -3.673496 -1.578511
C  5.880932 0.737387 0.218613
C  4.368626 0.541899 0.241016
C  6.526474 -0.52549 0.804235
C  6.303095 1.948086 1.056494
C  6.402942 0.946117 -1.205392
C  -2.691823 2.445215 0.027102
C  -4.457731 1.162401 1.082816
C  3.687983 -0.026482 -0.835948
C  3.613442 0.852491 1.373364
C  -3.285452 3.696007 0.647128
C  -4.99143 2.463618 1.654368
C  1.576464 0.055189 0.341326
C  0.121662 -0.186964 0.38638
C  2.324544 -0.270975 -0.788488
C  2.249961 0.616842 1.425095
C  -2.156522 0.356803 1.251161
C  -0.711621 0.648322 1.017483
C  -0.385008 -1.394233 -0.305173
C  -1.410834 -1.307688 -1.237133
C  0.16043 -2.65013 -0.045536
C  -1.847048 -2.485063 -1.82413
C  -0.362132 -3.749541 -0.697875
H  6.270371 -1.411193 0.219316
H  6.20119 -0.700619 1.831657
H  7.615373 -0.435199 0.810921
H  5.81574 2.864313 0.7181
H  7.380714 2.098064 0.972382
H  6.08566 1.825358 2.117689
H  6.25922 0.071544 -1.840188
H  7.475991 1.142692 -1.179606
H  5.923997 1.797621 -1.692438
H  -1.612985 2.556108 -0.062821
H  -3.088612 2.304969 -0.984215
H  -4.967398 0.922648 0.143462
H  -4.647039 0.349742 1.780304
H  4.218275 -0.293524 -1.739968
H  4.087859 1.275284 2.248805
H  -3.120545 4.550052 -0.011435
H  -2.783628 3.904463 1.602504
H  -4.589773 2.609257 2.666716
H  -6.078657 2.41362 1.730797
H  1.842258 -0.708357 -1.654208
H  1.709473 0.852098 2.333816
H  -0.320717 1.55764 1.462565
H  -1.848311 -0.355811 -1.506317
H  0.967654 -2.774713 0.663233
H  0.032973 -4.739759 -0.506413
elementType: Cl O N C H
totalener: -1573.67559345 hartree
nucrepener: 2542.25014978 hartree
electener: -4115.92574323 hartree
oneelecener: -7200.97674126 hartree
twoeener: 3085.05099804 hartree
cpcmener: -0.03810083 hartree
kineticenergy: 1568.01536466 hartree
xcener: -130.923146085343 hartree
chargesum: 0.0000000
charge: -0.085310 -0.376571 -0.514878 -0.058367 -0.320896 0.258527 -0.023700 -0.327135 -0.330372 -0.333460 -0.081302 -0.059090 -0.191308 -0.185470 0.023330 0.010374 -0.016598 0.213410 -0.183195 -0.186701 0.242446 -0.199815 -0.030736 -0.167928 -0.169206 0.186251 0.024608 0.099407 0.099373 0.098413 0.108556 0.097941 0.095174 0.094500 0.098526 0.109665 0.116241 0.104229 0.104498 0.098561 0.145361 0.145335 0.100158 0.082106 0.083703 0.100289 0.153168 0.149422 0.152834 0.144534 0.151819 0.149281
qa: -0.0853 -0.3766 -0.5149 -0.0584 -0.3209 0.2585 -0.0237 -0.3271 -0.3304 -0.3335 -0.0813 -0.0591 -0.1913 -0.1855 0.0233 0.0104 -0.0166 0.2134 -0.1832 -0.1867 0.2424 -0.1998 -0.0307 -0.1679 -0.1692 0.1863 0.0246 0.0994 0.0994 0.0984 0.1086 0.0979 0.0952 0.0945 0.0985 0.1097 0.1162 0.1042 0.1045 0.0986 0.1454 0.1453 0.1002 0.0821 0.0837 0.1003 0.1532 0.1494 0.1528 0.1445 0.1518 0.1493
va: 1.2196 1.9384 1.9919 3.1245 3.0449 3.7166 3.7211 3.9220 3.9038 3.9063 3.8649 3.8235 3.9721 3.9811 3.9535 3.9698 3.5706 3.3777 3.9817 4.0171 4.2217 3.7453 3.6512 3.9310 3.9266 4.1942 4.0268 1.0040 1.0038 1.0030 1.0019 1.0046 1.0047 1.0039 1.0047 1.0017 1.0048 1.0066 1.0064 1.0415 1.0004 1.0006 0.9977 1.0065 1.0029 0.9980 0.9953 1.0020 1.0001 1.0098 0.9975 0.9985
dispcorr: -0.026916477 hartree
energy: -1573.702509925185
dipole: 40.34486 -38.22901 2.11585 23.81266 -21.41196 2.40070 14.00048 -13.63865 0.36183
magnitude: 3.22041 au
magnitude: 8.18564 debye
