program: Orca
programVersion: 5.0.2
elementType: Cl O O N N C C C C C C C C C C C C C C C C C C C C C C H H H H H H H H H H H H H H H H H H H H H H H H H
charge: 0
multiplicity: 1
keywords: wb97x-d3
keywords: def2-TZVPP
keywords: def2/J RIJCOSX
keywords: DEFGRID2
keywords: scfconv7
keywords: smallprint printgap noloewdin
keywords: NOSOSCF
formula: C22H25ClN2O2
InChI: InChI=1/C22H25ClN2O2/c1-22(2,3)18-6-4-16(5-7-18)19(17-8-9-24-20(23)14-17)15-21(26)25-10-12-27-13-11-25/h4-9,14-15H,10-13H2,1-3H3
52 atoms
Cl -3.117329 -3.809594 0.178395
O  -4.795822 2.549991 -0.715572
O  -2.252338 0.543294 2.805306
N  -2.853473 1.086232 0.692557
N  -1.815607 -2.80075 -1.831614
C  5.946766 0.730827 -0.246827
C  4.43943 0.618595 -0.051258
C  6.662015 -0.046736 0.865826
C  6.431664 2.179821 -0.205531
C  6.323061 0.139409 -1.611798
C  -2.574873 1.58062 -0.638549
C  -4.265943 0.862588 0.936522
C  3.61343 1.723017 0.130447
C  3.827781 -0.636779 -0.062162
C  -3.432763 2.807979 -0.914163
C  -5.052321 2.116608 0.597141
C  1.6427 0.328895 0.289537
C  0.187683 0.171542 0.485724
C  2.243462 1.582848 0.294458
C  2.463414 -0.783205 0.097617
C  -1.944299 0.843992 1.667874
C  -0.491832 0.954113 1.333757
C  -0.490254 -0.87854 -0.305941
C  -1.371811 -1.775214 0.282061
C  -0.267651 -0.989551 -1.679039
C  -2.001355 -2.70108 -0.540149
C  -0.955359 -1.95552 -2.388233
H  7.744727 0.019192 0.741888
H  6.398036 -1.104659 0.863704
H  6.411969 0.353385 1.849292
H  5.983214 2.785706 -0.994704
H  7.51239 2.211521 -0.350243
H  6.220333 2.657008 0.752937
H  7.399671 0.214426 -1.776593
H  5.822045 0.670851 -2.422134
H  6.0539 -0.914216 -1.692857
H  -1.52388 1.845932 -0.734208
H  -2.790916 0.800149 -1.376865
H  -4.604933 0.025462 0.315055
H  -4.413471 0.588736 1.978592
H  4.027708 2.721395 0.136121
H  4.427261 -1.528459 -0.197246
H  -3.309528 3.121265 -1.952441
H  -3.09188 3.63369 -0.270621
H  -4.804979 2.904894 1.323473
H  -6.123074 1.919867 0.668215
H  1.63273 2.470337 0.405717
H  2.032559 -1.776491 0.088108
H  0.054619 1.650482 1.960048
H  -1.55928 -1.766691 1.346814
H  0.422972 -0.328278 -2.18463
H  -0.812259 -2.059203 -3.457401
totalener: -1573.64439404 hartree
nucrepener: 2587.09188419 hartree
electener: -4160.73627823 hartree
oneelecener: -7289.90437839 hartree
twoeener: 3129.16810016 hartree
kineticenergy: 1568.06966357 hartree
xcener: -130.930470596590 hartree
chargesum: 0.0000000
charge: -0.060889 -0.312669 -0.388892 -0.090110 -0.256188 0.247425 -0.054632 -0.291006 -0.335869 -0.290390 -0.104298 -0.069206 -0.137253 -0.140154 0.013990 0.014266 0.020041 0.103624 -0.156726 -0.194185 0.178270 -0.076140 0.007051 -0.206468 -0.165270 0.192128 0.012088 0.088477 0.088540 0.101507 0.094844 0.092431 0.097131 0.089101 0.098637 0.088647 0.102194 0.097908 0.092387 0.106082 0.119570 0.110243 0.086436 0.066849 0.071435 0.087707 0.122981 0.133394 0.108488 0.141111 0.132521 0.122843
qa: -0.0609 -0.3127 -0.3889 -0.0901 -0.2562 0.2474 -0.0546 -0.2910 -0.3359 -0.2904 -0.1043 -0.0692 -0.1373 -0.1402 0.0140 0.0143 0.0200 0.1036 -0.1567 -0.1942 0.1783 -0.0761 0.0071 -0.2065 -0.1653 0.1921 0.0121 0.0885 0.0885 0.1015 0.0948 0.0924 0.0971 0.0891 0.0986 0.0886 0.1022 0.0979 0.0924 0.1061 0.1196 0.1102 0.0864 0.0668 0.0714 0.0877 0.1230 0.1334 0.1085 0.1411 0.1325 0.1228
va: 1.2385 1.9999 2.1189 3.0667 3.0705 3.7723 3.7865 3.9233 3.9306 3.9223 3.8849 3.8257 3.9912 4.0498 4.0185 3.9786 3.5761 3.3750 4.0611 4.0750 4.2772 3.8000 3.6020 3.9447 3.8757 4.1700 4.0561 1.0061 1.0077 1.0059 1.0024 1.0120 1.0023 1.0065 1.0060 1.0076 1.0023 0.9978 1.0095 1.0453 1.0077 1.0120 0.9982 1.0064 1.0038 0.9992 1.0082 1.0019 1.0217 1.0344 1.0045 1.0016
dispcorr: -0.028823614 hartree
energy: -1573.673217656038
dipole: 40.62148 -39.01869 1.60279 25.29050 -24.02748 1.26302 -4.81860 3.92870 -0.88989
magnitude: 2.22622 au
magnitude: 5.65861 debye
