program: Orca
programVersion: 5.0.2
elementType: Cl O O N N C C C C C C C C C C C C C C C C C C C C C C H H H H H H H H H H H H H H H H H H H H H H H H H
charge: 0
multiplicity: 1
keywords: wb97x-d3
keywords: def2-TZVPP
keywords: def2/J RIJCOSX
keywords: DEFGRID2
keywords: scfconv7
keywords: smallprint printgap noloewdin
keywords: NOSOSCF
formula: C22H25ClN2O2
InChI: InChI=1/C22H25ClN2O2/c1-22(2,3)18-6-4-16(5-7-18)19(17-8-9-24-20(23)14-17)15-21(26)25-10-12-27-13-11-25/h4-9,14-15H,10-13H2,1-3H3
52 atoms
Cl -1.131172 -4.106782 0.5553
O  -4.934027 0.3062 1.542509
O  -2.299769 3.060237 -1.473079
N  -2.957376 1.913102 0.362969
N  -2.269346 -2.66146 -1.280122
C  5.762928 0.277424 0.231865
C  4.250714 0.423812 0.113501
C  6.416756 0.835456 -1.039559
C  6.128286 -1.204542 0.387294
C  6.325734 1.034809 1.434552
C  -2.699558 1.229263 1.613641
C  -4.364138 2.194563 0.141544
C  3.497031 1.222106 0.967509
C  3.561347 -0.25342 -0.894897
C  -3.577351 -0.010351 1.713959
C  -5.16402 0.912034 0.296304
C  1.447999 0.68239 -0.197561
C  -0.006913 0.847172 -0.392038
C  2.123866 1.348837 0.817696
C  2.193186 -0.137509 -1.0452
C  -2.026394 2.375255 -0.505391
C  -0.589266 2.044559 -0.257119
C  -0.784304 -0.365827 -0.72792
C  -0.582172 -1.54121 -0.013662
C  -1.734057 -0.380069 -1.748096
C  -1.360542 -2.643547 -0.337491
C  -2.443958 -1.545141 -1.976495
H  6.178656 1.891509 -1.173334
H  6.085993 0.307445 -1.934581
H  7.503043 0.74044 -0.984964
H  5.668281 -1.633308 1.278652
H  7.209801 -1.32128 0.47877
H  5.810025 -1.801347 -0.467745
H  6.141977 2.108408 1.368086
H  7.406521 0.89626 1.484839
H  5.908401 0.674972 2.376689
H  -1.650861 0.952036 1.691068
H  -2.924296 1.904101 2.448562
H  -4.707739 2.94061 0.867347
H  -4.496204 2.6133 -0.853453
H  3.97211 1.758013 1.777212
H  4.100526 -0.888444 -1.586827
H  -3.471191 -0.462726 2.701225
H  -3.251356 -0.74906 0.968489
H  -4.907804 0.225293 -0.524041
H  -6.231876 1.127045 0.233072
H  1.570545 1.964685 1.516232
H  1.699932 -0.676929 -1.844122
H  0.037929 2.912616 -0.085511
H  0.156647 -1.598073 0.773858
H  -1.905957 0.49181 -2.363848
H  -3.187133 -1.588984 -2.763981
totalener: -1573.64490356 hartree
nucrepener: 2613.90176897 hartree
electener: -4187.54667253 hartree
oneelecener: -7343.45813229 hartree
twoeener: 3155.91145976 hartree
kineticenergy: 1568.06812842 hartree
xcener: -130.931137524183 hartree
chargesum: 0.0000000
charge: -0.063413 -0.315597 -0.390612 -0.098233 -0.254285 0.244683 -0.056912 -0.289463 -0.290344 -0.334405 -0.118688 -0.084866 -0.132489 -0.137780 0.043902 0.017653 0.014666 0.107932 -0.166724 -0.186179 0.185241 -0.064017 0.024316 -0.250592 -0.176646 0.202938 0.011404 0.100316 0.088937 0.088563 0.099878 0.088534 0.088486 0.093495 0.092126 0.097752 0.103477 0.106068 0.095924 0.103711 0.119238 0.110413 0.094040 0.061389 0.065610 0.090737 0.124699 0.130415 0.109381 0.129090 0.146370 0.129858
qa: -0.0634 -0.3156 -0.3906 -0.0982 -0.2543 0.2447 -0.0569 -0.2895 -0.2903 -0.3344 -0.1187 -0.0849 -0.1325 -0.1378 0.0439 0.0177 0.0147 0.1079 -0.1667 -0.1862 0.1852 -0.0640 0.0243 -0.2506 -0.1766 0.2029 0.0114 0.1003 0.0889 0.0886 0.0999 0.0885 0.0885 0.0935 0.0921 0.0978 0.1035 0.1061 0.0959 0.1037 0.1192 0.1104 0.0940 0.0614 0.0656 0.0907 0.1247 0.1304 0.1094 0.1291 0.1464 0.1299
va: 1.2366 2.0016 2.1158 3.0751 3.0621 3.7768 3.7928 3.9235 3.9214 3.9308 3.8919 3.8497 3.9856 4.0484 3.9569 3.9750 3.5621 3.3500 4.0587 4.0675 4.2649 3.7959 3.5546 3.9732 3.8887 4.1396 4.0187 1.0064 1.0075 1.0062 1.0057 1.0065 1.0082 1.0027 1.0120 1.0024 1.0060 1.0085 1.0074 1.0440 1.0077 1.0115 1.0012 1.0288 1.0031 1.0010 1.0083 1.0028 1.0191 1.0212 1.0237 1.0011
dispcorr: -0.030058509 hartree
energy: -1573.674962072139
dipole: 32.04061 -30.88550 1.15512 17.61867 -17.14410 0.47457 4.50972 -3.80832 0.70140
magnitude: 1.43230 au
magnitude: 3.64061 debye
