program: Orca
programVersion: 5.0.2
elementType: Cl O O N N C C C C C C C C C C C C C C C C C C C C C C H H H H H H H H H H H H H H H H H H H H H H H H H
charge: 0
multiplicity: 1
keywords: wb97x-d3
keywords: def2-TZVPP
keywords: def2/J RIJCOSX
keywords: DEFGRID2
keywords: scfconv7
keywords: smallprint printgap noloewdin
keywords: NOSOSCF
formula: C22H25ClN2O2
InChI: InChI=1/C22H25ClN2O2/c1-22(2,3)18-6-4-16(5-7-18)19(17-8-9-24-20(23)14-17)15-21(26)25-10-12-27-13-11-25/h4-9,14-15H,10-13H2,1-3H3
52 atoms
Cl -3.425295 -2.983723 1.529039
O  -4.681576 0.803966 -1.638598
O  -2.160785 1.879202 2.388731
N  -2.774863 1.700585 0.218489
N  -1.978393 -2.985551 -0.629526
C  5.976533 0.483399 -0.49778
C  4.471666 0.530539 -0.261042
C  6.519429 1.806576 -1.037615
C  6.286667 -0.616897 -1.521868
C  6.694464 0.173473 0.822345
C  -2.494434 1.736331 -1.202229
C  -4.192466 1.770962 0.523701
C  3.810531 -0.588478 0.249785
C  3.693093 1.646119 -0.550876
C  -3.313752 0.673073 -1.919361
C  -4.928788 0.696749 -0.258894
C  1.671238 0.528857 0.167149
C  0.212687 0.530143 0.401418
C  2.44414 -0.596303 0.455263
C  2.321507 1.645537 -0.345486
C  -1.861239 1.741452 1.217728
C  -0.411701 1.617669 0.87103
C  -0.526194 -0.707044 0.067512
C  -1.492148 -1.228706 0.917689
C  -0.286014 -1.377908 -1.132453
C  -2.183458 -2.358291 0.500626
C  -1.036538 -2.499899 -1.430383
H  6.076545 2.070495 -1.999417
H  7.596673 1.728443 -1.189842
H  6.349541 2.632903 -0.345292
H  7.360373 -0.670812 -1.712141
H  5.787354 -0.420952 -2.471847
H  5.96585 -1.600465 -1.177441
H  6.491214 0.939638 1.571602
H  7.774478 0.134124 0.667579
H  6.390552 -0.786174 1.241292
H  -2.758749 2.725083 -1.597297
H  -1.434276 1.582907 -1.39003
H  -4.338861 1.636553 1.59295
H  -4.577646 2.761258 0.254127
H  4.371143 -1.481822 0.495798
H  4.146299 2.539198 -0.957525
H  -2.949502 -0.323452 -1.633863
H  -3.191147 0.776947 -2.998916
H  -6.005212 0.800809 -0.114714
H  -4.632739 -0.294087 0.11655
H  1.97363 -1.485085 0.856886
H  1.747969 2.524727 -0.612279
H  0.184306 2.472239 1.171803
H  -1.699412 -0.781894 1.879921
H  0.466589 -1.025168 -1.824515
H  -0.878861 -3.038142 -2.357554
totalener: -1573.64472181 hartree
nucrepener: 2624.13810338 hartree
electener: -4197.78282519 hartree
oneelecener: -7363.94892594 hartree
twoeener: 3166.16610075 hartree
kineticenergy: 1568.06787087 hartree
xcener: -130.932259529184 hartree
chargesum: -0.0000000
charge: -0.062880 -0.316669 -0.387407 -0.099207 -0.252745 0.246951 -0.053822 -0.336999 -0.289587 -0.290994 -0.122390 -0.084539 -0.135961 -0.139393 0.053181 0.019982 0.022488 0.101506 -0.197876 -0.156754 0.186359 -0.065933 0.038327 -0.247878 -0.189864 0.198379 0.023441 0.093865 0.092550 0.098593 0.089164 0.098513 0.088524 0.101119 0.088674 0.088618 0.106103 0.102199 0.105519 0.095411 0.110202 0.119646 0.052563 0.091046 0.090040 0.064161 0.132046 0.124480 0.109144 0.143335 0.132624 0.122145
qa: -0.0629 -0.3167 -0.3874 -0.0992 -0.2527 0.2470 -0.0538 -0.3370 -0.2896 -0.2910 -0.1224 -0.0845 -0.1360 -0.1394 0.0532 0.0200 0.0225 0.1015 -0.1979 -0.1568 0.1864 -0.0659 0.0383 -0.2479 -0.1899 0.1984 0.0234 0.0939 0.0925 0.0986 0.0892 0.0985 0.0885 0.1011 0.0887 0.0886 0.1061 0.1022 0.1055 0.0954 0.1102 0.1196 0.0526 0.0910 0.0900 0.0642 0.1320 0.1245 0.1091 0.1433 0.1326 0.1221
va: 1.2353 2.0028 2.1187 3.0720 3.0623 3.7733 3.7867 3.9308 3.9221 3.9229 3.8963 3.8489 4.0415 3.9911 3.9541 3.9737 3.5704 3.3608 4.0712 4.0568 4.2580 3.8064 3.5429 3.9950 3.8873 4.1252 4.0316 1.0024 1.0120 1.0021 1.0067 1.0062 1.0075 1.0059 1.0062 1.0077 1.0086 1.0059 1.0423 1.0075 1.0118 1.0077 1.0302 1.0012 1.0023 1.0151 1.0030 1.0082 1.0201 1.0367 1.0058 1.0035
dispcorr: -0.030644401 hartree
energy: -1573.675366210676
dipole: 42.21205 -40.51971 1.69233 16.62388 -15.95859 0.66528 -13.81481 12.54764 -1.26717
magnitude: 2.21637 au
magnitude: 5.63357 debye
