program: Orca
programVersion: 5.0.2
elementType: Cl O O N N C C C C C C C C C C C C C C C C C C C C C C H H H H H H H H H H H H H H H H H H H H H H H H H
charge: 0
multiplicity: 1
keywords: wb97x-d3
keywords: def2-TZVPP
keywords: def2/J RIJCOSX
keywords: DEFGRID2
keywords: scfconv7
keywords: smallprint printgap noloewdin
keywords: NOSOSCF
formula: C22H25ClN2O2
InChI: InChI=1/C22H25ClN2O2/c1-22(2,3)18-6-4-16(5-7-18)19(17-8-9-24-20(23)14-17)15-21(26)25-10-12-27-13-11-25/h4-9,14-15H,10-13H2,1-3H3
52 atoms
Cl -1.129685 -4.061392 0.72171
O  -4.916516 0.350192 1.608268
O  -2.328304 3.03522 -1.527511
N  -2.959844 1.906293 0.328919
N  -2.267534 -2.688632 -1.169036
C  5.749538 0.236634 0.242484
C  4.244581 0.422252 0.09492
C  6.038253 -1.214356 0.649112
C  6.344859 1.161334 1.304611
C  6.436912 0.539048 -1.095471
C  -2.684239 1.279142 1.605817
C  -4.370405 2.171774 0.111661
C  3.505987 1.291127 0.891449
C  3.54145 -0.313886 -0.860776
C  -3.556556 0.042994 1.771849
C  -5.164552 0.896345 0.337914
C  1.443234 0.695549 -0.22145
C  -0.012689 0.854824 -0.409876
C  2.133981 1.423634 0.740212
C  2.174719 -0.187895 -1.015645
C  -2.039487 2.369169 -0.551279
C  -0.597748 2.05466 -0.311297
C  -0.790641 -0.370173 -0.697575
C  -0.586657 -1.518053 0.059508
C  -1.739529 -0.423375 -1.716849
C  -1.361707 -2.63324 -0.224892
C  -2.444616 -1.598575 -1.90523
H  5.561722 -1.458574 1.599476
H  7.112583 -1.373104 0.761243
H  5.678064 -1.927724 -0.092781
H  6.182762 2.214376 1.068587
H  7.422575 1.005628 1.367991
H  5.933052 0.967069 2.296342
H  6.095805 -0.120495 -1.893699
H  7.516964 0.408265 -1.005538
H  6.248208 1.565444 -1.412752
H  -1.633669 1.009236 1.68348
H  -2.902087 1.989366 2.412921
H  -4.709072 2.952117 0.803082
H  -4.516745 2.540214 -0.901134
H  3.992147 1.877533 1.658399
H  4.068361 -1.006273 -1.505536
H  -3.433732 -0.36727 2.775346
H  -3.240696 -0.725731 1.05266
H  -4.917448 0.171607 -0.451989
H  -6.233597 1.106433 0.278641
H  1.592937 2.092118 1.398762
H  1.671741 -0.774672 -1.774049
H  0.026927 2.931284 -0.179729
H  0.152045 -1.544281 0.848771
H  -1.913028 0.425948 -2.363108
H  -3.186417 -1.673127 -2.691691
totalener: -1573.64482317 hartree
nucrepener: 2615.66473629 hartree
electener: -4189.30955946 hartree
oneelecener: -7346.97524443 hartree
twoeener: 3157.66568498 hartree
kineticenergy: 1568.07213942 hartree
xcener: -130.931962216130 hartree
chargesum: -0.0000000
charge: -0.063472 -0.315876 -0.389996 -0.099679 -0.254090 0.242904 -0.054560 -0.288182 -0.334521 -0.291671 -0.119686 -0.085759 -0.135195 -0.137837 0.042558 0.019035 0.014755 0.104847 -0.160995 -0.190304 0.185164 -0.062236 0.030004 -0.257531 -0.172701 0.204541 0.008815 0.099661 0.088648 0.089046 0.098320 0.092089 0.093107 0.088354 0.088503 0.101272 0.104351 0.106150 0.095708 0.103550 0.119515 0.110694 0.094145 0.062621 0.065062 0.090799 0.124244 0.132143 0.108875 0.129297 0.145734 0.129777
qa: -0.0635 -0.3159 -0.3900 -0.0997 -0.2541 0.2429 -0.0546 -0.2882 -0.3345 -0.2917 -0.1197 -0.0858 -0.1352 -0.1378 0.0426 0.0190 0.0148 0.1048 -0.1610 -0.1903 0.1852 -0.0622 0.0300 -0.2575 -0.1727 0.2045 0.0088 0.0997 0.0886 0.0890 0.0983 0.0921 0.0931 0.0884 0.0885 0.1013 0.1044 0.1062 0.0957 0.1035 0.1195 0.1107 0.0941 0.0626 0.0651 0.0908 0.1242 0.1321 0.1089 0.1293 0.1457 0.1298
va: 1.2367 2.0019 2.1159 3.0694 3.0613 3.7791 3.7893 3.9223 3.9300 3.9225 3.8904 3.8528 3.9885 4.0507 3.9596 3.9748 3.5747 3.3466 4.0616 4.0704 4.2613 3.7975 3.5565 3.9726 3.8868 4.1373 4.0216 1.0064 1.0062 1.0075 1.0024 1.0120 1.0028 1.0081 1.0063 1.0058 1.0057 1.0088 1.0077 1.0430 1.0078 1.0116 1.0011 1.0280 1.0033 1.0009 1.0083 1.0017 1.0198 1.0211 1.0225 1.0011
dispcorr: -0.030072946 hartree
energy: -1573.674896112272
dipole: 31.99347 -30.81913 1.17434 17.14796 -16.68552 0.46244 4.03484 -3.35921 0.67563
magnitude: 1.43157 au
magnitude: 3.63877 debye
