program: Orca
programVersion: 5.0.2
elementType: O O O O O O O O O O O O O N N N N N C C C C C C C C C C C C C C C C C H H H H H H H H H H H H H H H H H H H H H H H H H
charge: 0
multiplicity: 1
keywords: wb97x-d3
keywords: def2-TZVPP
keywords: def2/J RIJCOSX
keywords: DEFGRID2
keywords: scfconv7
keywords: smallprint printgap noloewdin
keywords: NOSOSCF
formula: C17H25N5O13
InChI: InChI=1/C17H25N5O13/c18-6(8(25)5(24)3-34-16(19)32)13(29)20-7(15(30)31)11-9(26)10(27)14(35-11)22-1-4(2-23)12(28)21-17(22)33/h1,5-11,14,20-21,23-27,30H,2-3,18-19H2
60 atoms
O  -2.633322 -0.980004 1.524689
O  -4.109304 1.411721 2.486565
O  -1.577506 2.090615 2.897338
O  -5.532651 -0.209618 -1.252581
O  -4.267845 1.36074 -2.213265
O  0.712912 0.592328 3.246701
O  -1.031042 -1.535237 -2.015175
O  1.269951 0.768566 -0.428691
O  2.511385 2.476143 -2.305376
O  3.283734 -2.396782 1.043167
O  1.350554 -3.279159 -1.552707
O  4.124723 0.047078 -0.914326
O  4.305421 2.200451 -0.266759
N  -0.34067 -0.889763 1.880715
N  -2.000131 0.333784 -1.167829
N  1.950833 -0.947558 2.152624
N  -0.444425 1.971453 -2.478159
N  4.84458 0.500086 1.122934
C  -3.484494 -0.104732 0.79575
C  -3.241314 1.276045 1.390497
C  -1.782645 1.193096 1.850147
C  -1.652727 -0.297649 2.234422
C  -3.237759 -0.232452 -0.719554
C  -4.38854 0.409336 -1.487222
C  -0.233684 -1.966823 1.053004
C  0.769833 -0.351229 2.471703
C  -1.06168 -0.317469 -1.867357
C  -0.005352 0.588697 -2.501471
C  1.338482 0.390561 -1.782126
C  0.937577 -2.546171 0.725525
C  2.498041 1.08385 -2.52611
C  2.154657 -1.996102 1.271994
C  0.993077 -3.683474 -0.248843
C  3.839646 0.408434 -2.268381
C  4.413807 1.003866 -0.036766
H  -4.510453 -0.421578 0.992951
H  -3.386761 2.083467 0.660687
H  -1.118366 1.397925 1.002419
H  -1.797489 -0.440562 3.310747
H  -3.242508 -1.300206 -0.957865
H  -1.904162 1.34532 -1.205547
H  -3.7609 2.100486 3.065371
H  -0.706984 1.889736 3.271642
H  -1.161915 -2.356525 0.66658
H  0.129732 0.192732 -3.517228
H  1.542948 -0.682122 -1.788515
H  2.773824 -0.52543 2.568303
H  2.33319 0.935762 -3.600117
H  -6.259022 0.223605 -1.729497
H  -1.106443 2.142703 -3.224691
H  0.330761 2.606823 -2.615868
H  0.027587 -4.201998 -0.240859
H  1.74054 -4.411254 0.070632
H  3.848207 -0.545556 -2.793949
H  4.65186 1.016065 -2.678394
H  1.108714 1.717936 -0.374105
H  3.096461 2.646849 -1.546102
H  0.632138 -2.724544 -1.889828
H  4.96491 -0.49088 1.259934
H  5.101268 1.124687 1.868957
elementType: O N C H
totalener: -1914.95452120 hartree
nucrepener: 4531.20633448 hartree
electener: -6446.16085568 hartree
twoeener: 5199.02646183 hartree
cpcmener: -0.08056764 hartree
kineticenergy: 1907.24487287 hartree
xcener: -172.912758339948 hartree
chargesum: 0.0000000
charge: -0.375373 -0.419622 -0.438105 -0.283912 -0.419651 -0.520171 -0.544030 -0.405262 -0.483141 -0.488317 -0.443264 -0.297897 -0.528914 -0.018690 -0.196478 -0.105258 -0.424623 -0.298227 0.189374 0.134422 0.077715 0.123116 0.029123 0.372753 0.038826 0.401623 0.297232 0.097045 0.184609 -0.139926 0.136495 0.258761 0.043633 -0.024788 0.492452 0.114055 0.110745 0.074038 0.131813 0.116555 0.186770 0.233877 0.255272 0.139971 0.121006 0.063265 0.188332 0.102545 0.259095 0.150385 0.158862 0.107685 0.099465 0.117645 0.125444 0.209337 0.248906 0.246009 0.214147 0.203247
qa: -0.3754 -0.4196 -0.4381 -0.2839 -0.4197 -0.5202 -0.5440 -0.4053 -0.4831 -0.4883 -0.4433 -0.2979 -0.5289 -0.0187 -0.1965 -0.1053 -0.4246 -0.2982 0.1894 0.1344 0.0777 0.1231 0.0291 0.3728 0.0388 0.4016 0.2972 0.0970 0.1846 -0.1399 0.1365 0.2588 0.0436 -0.0248 0.4925 0.1141 0.1107 0.0740 0.1318 0.1166 0.1868 0.2339 0.2553 0.1400 0.1210 0.0633 0.1883 0.1025 0.2591 0.1504 0.1589 0.1077 0.0995 0.1176 0.1254 0.2093 0.2489 0.2460 0.2141 0.2032
va: 2.0333 2.0361 2.0007 2.2186 2.0716 1.9867 1.9698 2.0197 1.9516 2.0366 1.9578 2.0751 1.9716 3.2408 3.1915 3.2119 2.9966 3.2348 3.8090 3.9502 3.9784 3.8364 3.8299 4.2895 3.9345 4.3057 4.1641 3.9083 3.6868 3.4869 3.9242 4.3038 3.9756 3.8759 4.3547 1.0330 1.0197 1.0673 1.0169 1.0567 1.0506 1.0226 1.0275 1.0341 1.0178 1.0678 1.0245 1.0087 0.9937 1.0174 1.0506 0.9882 0.9953 0.9993 1.0090 1.0375 1.0512 1.0321 1.0087 1.0005
dispcorr: -0.046997335 hartree
energy: -1915.001518538810
dipole: 2.73282 -4.37857 -1.64575 3.35261 -2.74368 0.60893 -8.63804 8.40794 -0.23009
magnitude: 1.76981 au
magnitude: 4.49850 debye
