program: Orca
programVersion: 5.0.2
elementType: O O O O O O O O O O O O O N N N N N C C C C C C C C C C C C C C C C C H H H H H H H H H H H H H H H H H H H H H H H H H
charge: 0
multiplicity: 1
keywords: wb97x-d3
keywords: def2-TZVPP
keywords: def2/J RIJCOSX
keywords: DEFGRID2
keywords: scfconv7
keywords: smallprint printgap noloewdin
keywords: NOSOSCF
formula: C17H25N5O13
InChI: InChI=1/C17H25N5O13/c18-6(8(25)5(24)3-34-16(19)32)13(29)20-7(15(30)31)11-9(26)10(27)14(35-11)22-1-4(2-23)12(28)21-17(22)33/h1,5-11,14,20-21,23-27,30H,2-3,18-19H2
60 atoms
O  -2.661785 -0.982486 1.412484
O  -4.16767 1.354966 2.496131
O  -1.644704 1.994753 2.99924
O  -5.536263 -0.072214 -1.359381
O  -4.270648 1.566967 -2.196458
O  0.621124 0.434294 3.35757
O  -1.168903 -1.270225 -2.338099
O  1.254521 0.806007 -0.478573
O  2.555838 2.544056 -2.327322
O  3.269807 -2.412187 1.055613
O  1.514537 -4.715572 -0.038538
O  4.063953 0.034321 -0.962958
O  4.325441 2.172398 -0.291888
N  -0.370145 -0.899233 1.804487
N  -2.00715 0.486214 -1.169016
N  1.902768 -1.019122 2.197915
N  -0.42663 2.227612 -2.347798
N  4.813408 0.439056 1.074448
C  -3.513897 -0.06648 0.734809
C  -3.279863 1.278147 1.411214
C  -1.827713 1.170422 1.889238
C  -1.693458 -0.341632 2.173882
C  -3.252783 -0.102893 -0.780545
C  -4.395108 0.572993 -1.530527
C  -0.224341 -1.868029 0.855338
C  0.709967 -0.435939 2.504289
C  -1.132251 -0.093188 -2.009467
C  -0.047755 0.840248 -2.541896
C  1.286984 0.50419 -1.852691
C  0.961415 -2.418247 0.532223
C  2.484416 1.157278 -2.569005
C  2.139321 -1.984693 1.239816
C  1.102203 -3.460678 -0.535754
C  3.795308 0.422974 -2.313027
C  4.390658 0.969943 -0.075041
H  -4.540107 -0.3970 0.906841
H  -3.413372 2.123742 0.723535
H  -1.147404 1.436817 1.071666
H  -1.847487 -0.556108 3.236895
H  -3.248123 -1.154933 -1.080233
H  -1.883406 1.489123 -1.071291
H  -3.831781 2.012363 3.117235
H  -0.789818 1.760058 3.388805
H  -1.130025 -2.184802 0.362312
H  0.070423 0.560449 -3.597465
H  1.411358 -0.580414 -1.93014
H  2.701508 -0.670945 2.716812
H  2.323411 1.031749 -3.646603
H  -6.257375 0.379023 -1.827216
H  0.360618 2.842746 -2.509216
H  -1.144778 2.487278 -3.013191
H  1.786617 -3.098263 -1.312027
H  0.134378 -3.610871 -1.016329
H  3.767686 -0.524029 -2.850662
H  4.632513 1.002158 -2.714117
H  1.108113 1.753388 -0.371981
H  3.139303 2.677219 -1.559182
H  2.440323 -4.646222 0.21616
H  4.850522 -0.557592 1.218234
H  5.048397 1.045752 1.841877
elementType: O N C H
totalener: -1914.95256644 hartree
nucrepener: 4490.32242724 hartree
electener: -6405.27499368 hartree
twoeener: 5157.69263716 hartree
cpcmener: -0.08098850 hartree
kineticenergy: 1907.24684793 hartree
xcener: -172.908838743008 hartree
chargesum: 0.0000000
charge: -0.374015 -0.418985 -0.437723 -0.284654 -0.421792 -0.518896 -0.518029 -0.408489 -0.484996 -0.506802 -0.433331 -0.299192 -0.529298 -0.009221 -0.199707 -0.104741 -0.429774 -0.300594 0.191166 0.135344 0.074030 0.123675 0.027329 0.375228 0.022796 0.406442 0.258414 0.115535 0.170370 -0.150374 0.151808 0.282677 0.078777 -0.029854 0.491491 0.112573 0.109520 0.072673 0.133099 0.114034 0.182709 0.233621 0.255223 0.140920 0.120981 0.075245 0.186874 0.100147 0.258314 0.157250 0.148725 0.105344 0.088185 0.117269 0.125637 0.210476 0.248926 0.237059 0.217696 0.202885
qa: -0.3740 -0.4190 -0.4377 -0.2847 -0.4218 -0.5189 -0.5180 -0.4085 -0.4850 -0.5068 -0.4333 -0.2992 -0.5293 -0.0092 -0.1997 -0.1047 -0.4298 -0.3006 0.1912 0.1353 0.0740 0.1237 0.0273 0.3752 0.0228 0.4064 0.2584 0.1155 0.1704 -0.1504 0.1518 0.2827 0.0788 -0.0299 0.4915 0.1126 0.1095 0.0727 0.1331 0.1140 0.1827 0.2336 0.2552 0.1409 0.1210 0.0752 0.1869 0.1001 0.2583 0.1572 0.1487 0.1053 0.0882 0.1173 0.1256 0.2105 0.2489 0.2371 0.2177 0.2029
va: 2.0365 2.0354 2.0015 2.2185 2.0697 1.9888 1.9993 2.0209 1.9519 2.0039 1.9540 2.0725 1.9716 3.2409 3.1590 3.2358 2.9881 3.2355 3.8139 3.9495 3.9722 3.8288 3.8226 4.2813 3.9724 4.3042 4.2211 3.8585 3.7286 3.4996 3.8906 4.2624 3.9429 3.8775 4.3586 1.0336 1.0204 1.0662 1.0174 1.0607 1.0487 1.0226 1.0270 1.0322 1.0199 1.0358 1.0211 1.0086 0.9943 1.0487 1.0188 0.9908 1.0066 0.9969 1.0089 1.0378 1.0517 1.0069 1.0103 1.0006
dispcorr: -0.045948005 hartree
energy: -1914.998514441737
dipole: 4.26094 -4.70372 -0.44278 4.41372 -3.42888 0.98485 -9.01920 8.58204 -0.43716
magnitude: 1.16494 au
magnitude: 2.96104 debye
