program: Orca
programVersion: 5.0.2
elementType: O O O O O O O O O O O O O N N N N N C C C C C C C C C C C C C C C C C H H H H H H H H H H H H H H H H H H H H H H H H H
charge: 0
multiplicity: 1
keywords: wb97x-d3
keywords: def2-TZVPP
keywords: def2/J RIJCOSX
keywords: DEFGRID2
keywords: scfconv7
keywords: smallprint printgap noloewdin
keywords: NOSOSCF
formula: C17H25N5O13
InChI: InChI=1/C17H25N5O13/c18-6(8(25)5(24)3-34-16(19)32)13(29)20-7(15(30)31)11-9(26)10(27)14(35-11)22-1-4(2-23)12(28)21-17(22)33/h1,5-11,14,20-21,23-27,30H,2-3,18-19H2
60 atoms
O  -2.615032 -1.005101 1.383597
O  -4.167539 1.341877 2.435339
O  -1.647316 2.091063 2.802993
O  -5.652597 -0.351721 -1.269195
O  -4.536758 1.349253 -2.190791
O  0.642238 0.68203 3.200079
O  -0.934851 -1.415565 -1.789125
O  1.343549 0.749816 -0.362179
O  2.576753 2.518492 -2.076091
O  3.318638 -2.340361 1.177271
O  1.37744 -3.276697 -1.452581
O  4.152757 -0.043848 -1.055146
O  4.687158 2.047387 -0.403702
N  -0.356742 -0.88022 1.878177
N  -2.166471 0.420238 -1.291003
N  1.928802 -0.887947 2.21401
N  -0.470154 2.129102 -2.286306
N  5.047168 0.26443 0.942144
C  -3.533915 -0.145248 0.71908
C  -3.311654 1.233344 1.326407
C  -1.845923 1.179666 1.767317
C  -1.694619 -0.306191 2.158528
C  -3.34758 -0.232118 -0.80931
C  -4.564113 0.357935 -1.509421
C  -0.206215 -1.995264 1.108988
C  0.729944 -0.295469 2.47142
C  -1.083928 -0.196962 -1.776207
C  -0.032215 0.748758 -2.36232
C  1.341984 0.448279 -1.738378
C  0.984635 -2.557505 0.825544
C  2.488534 1.168667 -2.474384
C  2.175247 -1.958723 1.372842
C  1.078271 -3.699728 -0.139438
C  3.801875 0.405651 -2.367266
C  4.626936 0.844568 -0.183701
H  -4.538731 -0.501475 0.956458
H  -3.483169 2.044926 0.607432
H  -1.195982 1.383632 0.907864
H  -1.898598 -0.452225 3.225549
H  -3.301107 -1.293672 -1.071002
H  -2.186527 1.420374 -1.472867
H  -3.824348 2.032918 3.014716
H  -0.777241 1.893475 3.182845
H  -1.115634 -2.426625 0.724494
H  0.025095 0.470845 -3.419674
H  1.515535 -0.626392 -1.825387
H  2.732449 -0.437628 2.638439
H  2.259018 1.149521 -3.54748
H  -6.425291 0.051557 -1.697202
H  -0.145404 2.582007 -1.441458
H  -0.108524 2.663656 -3.063762
H  0.14137 -4.267787 -0.105511
H  1.872037 -4.385355 0.160174
H  3.711707 -0.513962 -2.944049
H  4.619525 0.986791 -2.803734
H  1.55185 1.687068 -0.256261
H  3.356066 2.61377 -1.501288
H  0.656704 -2.698103 -1.741243
H  4.892217 -0.717275 1.117267
H  5.352129 0.845009 1.705306
elementType: O N C H
totalener: -1914.95481193 hartree
nucrepener: 4515.74715708 hartree
electener: -6430.70196901 hartree
twoeener: 5183.32514491 hartree
cpcmener: -0.08091202 hartree
kineticenergy: 1907.24354446 hartree
xcener: -172.913677990773 hartree
chargesum: -0.0000000
charge: -0.375927 -0.421835 -0.443624 -0.282395 -0.415890 -0.516376 -0.553199 -0.420447 -0.479426 -0.500473 -0.446107 -0.297024 -0.529935 -0.021723 -0.180348 -0.102249 -0.376709 -0.307706 0.192951 0.134088 0.090572 0.126565 0.038777 0.369712 0.050751 0.396666 0.298246 0.100869 0.178022 -0.141169 0.121080 0.271274 0.052702 -0.023068 0.485577 0.110439 0.111020 0.070231 0.131031 0.113286 0.180339 0.233092 0.255098 0.136174 0.102587 0.065895 0.187058 0.096607 0.259424 0.148278 0.143945 0.104013 0.096925 0.117690 0.126843 0.214867 0.246834 0.248417 0.226286 0.201398
qa: -0.3759 -0.4218 -0.4436 -0.2824 -0.4159 -0.5164 -0.5532 -0.4204 -0.4794 -0.5005 -0.4461 -0.2970 -0.5299 -0.0217 -0.1803 -0.1022 -0.3767 -0.3077 0.1930 0.1341 0.0906 0.1266 0.0388 0.3697 0.0508 0.3967 0.2982 0.1009 0.1780 -0.1412 0.1211 0.2713 0.0527 -0.0231 0.4856 0.1104 0.1110 0.0702 0.1310 0.1133 0.1803 0.2331 0.2551 0.1362 0.1026 0.0659 0.1871 0.0966 0.2594 0.1483 0.1439 0.1040 0.0969 0.1177 0.1268 0.2149 0.2468 0.2484 0.2263 0.2014
va: 2.0284 2.0340 1.9962 2.2191 2.0779 1.9905 1.9555 2.0117 1.9666 2.0220 1.9570 2.0768 1.9672 3.2472 3.1615 3.2148 3.0598 3.2321 3.7686 3.9398 3.9844 3.8348 3.8275 4.3083 3.9184 4.3115 4.1554 3.9791 3.6707 3.5065 3.9578 4.2876 3.9727 3.8697 4.3641 1.0317 1.0202 1.0716 1.0178 1.0560 1.0656 1.0238 1.0326 1.0394 1.0240 1.0660 1.0215 1.0109 0.9932 1.0376 1.0275 0.9876 0.9959 1.0001 1.0098 1.0422 1.0533 1.0288 1.0133 1.0010
dispcorr: -0.046565097 hartree
energy: -1915.001377028363
dipole: 3.10909 -4.62221 -1.51312 3.53115 -2.99159 0.53956 -8.04353 8.02065 -0.02287
magnitude: 1.60660 au
magnitude: 4.08366 debye
