program: Gaussian 09
title: 000065824
version: EM64L-G09RevD.01
frameworkgroup: C1[X(C20H26N2O4)]
method: RPBEPBE
basis: SDD
operation: Freq
keyword: #p
keyword: freq=noraman
keyword: PBEPBE/SDD
title: #p freq=noraman PBEPBE/SDD
converged: YES YES NO NO
title: Mulliken charges:
elementType: O O O O N N C C C C C C C C C C C C C C C C C C C C H H H H H H H H H H H H H H H H H H H H H H H H H H
charge: -0.314981 -0.449645 -0.257824 -0.272920 -0.339287 -0.474781 -0.428681 -0.126841 -0.024995 -0.307220 -0.718835 -0.659932 0.390069 -0.395614 -0.317535 0.499182 -0.327701 -0.470309 0.257129 0.121624 -0.330182 -0.352263 0.331360 -0.352508 -0.365942 -0.537476 0.232604 0.221461 0.212720 0.189249 0.250497 0.225882 0.237094 0.221956 0.207949 0.218028 0.214902 0.222347 0.202305 0.352660 0.246960 0.250868 0.312886 0.215794 0.306821 0.276852 0.211468 0.256070 0.242347 0.222898 0.223897 0.249591
chargesum: 0.00000
title: Mulliken charges with hydrogens summed into heavy atoms:
elementType: O O O O N N C C C C C C C C C C C C C C C C C C C C
charge: -0.314981 -0.096985 -0.257824 -0.272920 -0.088790 -0.167960 0.025383 0.085880 0.164254 0.155755 -0.070901 -0.020379 0.390069 -0.148654 -0.066667 0.499182 -0.014815 -0.254514 0.257129 0.121624 -0.053329 -0.140795 0.331360 -0.096438 -0.123595 0.158911
polarizability: 4.40728271e+02 -3.26543565e+01 1.64661818e+02 2.81265586e-01 1.49375288e+00 2.25763224e+02
1716.lowfreq: -8.8434 -3.6918 -1.0466 -0.0011 0.0005 0.0015 9.0356 15.5292 23.2044
frequency: 8.2095 15.4791 22.8809 31.3790 35.8399 42.2147 51.1139 74.0442 77.2757 96.5898 102.8465 122.5145 136.8665 150.6157 168.2997 187.6101 195.8120 213.8258 225.0053 239.4887 245.2957 271.1836 281.1085 306.9248 314.5315 343.0010 371.2116 381.2649 386.3940 413.2730 414.5605 422.8832 436.0980 449.0774 457.7281 464.3169 491.8364 507.8767 523.2906 531.7785 588.0690 622.0680 625.2265 634.6140 636.1506 669.7339 682.0799 716.9993 753.8939 760.2303 784.5329 802.5347 807.8299 812.8198 832.8810 844.6914 850.4959 854.3777 868.2509 914.4174 916.0750 925.3249 932.3901 933.7318 948.2065 955.5728 983.9671 986.1410 988.4469 998.0696 1000.7455 1003.9310 1077.3484 1086.0794 1086.4043 1103.6320 1111.7080 1116.3088 1122.2666 1134.7600 1155.7191 1155.8678 1177.8972 1180.4804 1183.6948 1213.3522 1217.1536 1226.5315 1237.0058 1247.8619 1248.5543 1267.7521 1301.8690 1306.6243 1309.7855 1331.9619 1336.2310 1348.6072 1365.9233 1370.7619 1373.3152 1376.5489 1380.2440 1389.0436 1420.0147 1425.6665 1435.9462 1449.3525 1454.5046 1464.4197 1466.9533 1468.0916 1471.2185 1476.7819 1484.5859 1490.0353 1490.8841 1502.2288 1510.0857 1563.7874 1590.6322 1604.4935 1618.9591 1628.5880 2863.9379 2926.2456 2963.2101 2972.4381 2978.6312 2981.4157 3027.8542 3053.0433 3053.1107 3056.8843 3064.5499 3077.9028 3083.6556 3088.6529 3110.3165 3115.1294 3129.9086 3155.7619 3157.2219 3163.7442 3169.0495 3175.7711 3196.3733 3427.1843 3530.0094 3535.2223
redmass: 4.6339 4.4496 3.9285 2.9975 4.8594 4.1001 4.5066 5.1487 4.6188 3.3988 4.4565 4.2955 5.0746 4.8053 4.8183 2.4513 2.2110 1.4962 1.4484 2.5083 1.1144 4.6677 3.2826 4.8292 3.0564 6.1130 3.8039 2.6981 5.0479 3.0328 2.9445 2.3181 1.2980 3.6944 2.5524 4.5761 2.9430 2.9739 2.4568 3.7487 4.9591 1.6330 5.5415 3.2653 3.6236 1.5099 4.2215 3.6938 4.4170 5.2788 4.6000 1.4092 1.4811 2.4437 5.0575 2.9429 1.5060 1.6526 5.7709 1.6840 1.2274 1.8392 1.9332 1.3976 1.5736 2.8218 6.8491 1.3087 1.4342 2.8467 2.6392 2.0109 2.0443 3.2428 2.8990 1.8423 1.2600 1.3639 1.3224 2.1108 1.6290 1.3247 1.4810 1.6302 1.2653 1.9421 1.4730 1.4904 2.8793 2.5142 1.4018 2.3612 1.3100 1.3729 1.3446 1.4589 1.3096 1.3868 1.7829 1.7751 4.7587 1.5892 1.4025 1.2153 4.2646 4.1030 1.1724 1.1374 1.1116 1.1114 1.0488 1.0502 1.0845 1.0848 1.0852 1.0594 2.1149 2.5431 2.5280 7.1010 7.0641 4.5105 6.2219 6.4453 1.0826 1.0695 1.0329 1.0361 1.0551 1.0356 1.0852 1.1069 1.1042 1.0931 1.0988 1.0992 1.0997 1.0992 1.0899 1.0889 1.0996 1.0883 1.0907 1.0934 1.0933 1.0972 1.0952 1.0740 1.0652 1.0757
irintensity: 0.2415 2.1304 0.7306 0.4410 0.3228 0.2673 0.1493 1.1650 0.6679 0.8936 2.4218 7.4700 5.6611 2.6427 2.9073 2.4285 2.6429 4.1476 0.0909 0.6062 0.5024 17.0736 0.5880 0.4107 6.2370 0.2054 10.7275 7.1776 12.6885 0.3941 1.1277 10.5640 130.7884 8.4188 68.3283 0.4034 2.6109 13.0034 38.6866 29.6541 27.3883 28.3637 5.3529 12.4817 5.7142 66.2768 26.5366 0.2060 14.7350 7.0408 4.1326 31.8739 26.2610 1.6974 13.0983 14.5370 68.5956 47.7367 14.0237 23.5776 5.4291 39.3379 4.2215 0.5339 12.8076 59.5206 59.5178 3.4844 2.4162 3.4923 19.2989 51.9521 53.1652 33.7763 11.9515 8.3813 0.2098 29.8787 21.4030 26.5621 33.1086 11.4829 189.6199 114.7319 59.5555 360.5122 24.8600 47.5738 92.1153 183.3634 36.9616 14.3232 16.0667 2.9010 20.0792 7.5392 12.4895 12.2915 110.2350 90.8418 1.9793 70.3459 30.6778 29.9701 4.4187 18.2888 11.9145 24.9061 150.6462 2.7831 2.6266 14.7632 77.2199 7.9587 6.5054 38.0758 75.9953 403.3455 305.0862 44.8166 75.2196 69.1444 138.4841 31.2499 92.8957 87.6629 70.4298 38.8584 27.9088 14.9940 28.1438 14.8208 50.8543 37.1916 43.3329 33.1356 24.8492 67.3274 24.2941 22.1465 22.8806 0.9744 6.7346 12.4421 12.5816 6.7660 9.6976 1.9705 16.3819 7.1537
temp: 298.150 k
press: 1.00000 atm
elementType: 8 8 8 8 7 7 6 6 6 6 6 6 6 6 6 6 6 6 6 6 6 6 6 6 6 6 1 1 1 1 1 1 1 1 1 1 1 1 1 1 1 1 1 1 1 1 1 1 1 1 1 1
symmnumber: 1
zpe: 1121270.5 jmol-1
zpe.correction: 0.427069 hartree
zpe.thermalcorrener: 0.453849 hartree
zpe.thermalcorrenthalpy: 0.454793 hartree
zpe.thermalcorrgfe: 0.365499 hartree
zpe.sumelectzpe: -1186.156453 hartree
zpe.sumelectthermal: -1186.129673 hartree
zpe.sumelectthermalent: -1186.128729 hartree
zpe.sumelectthermalfe: -1186.218023 hartree
dipole: -1.7671 2.4432 -5.7952
dipole: 6.5327
quadrupole: -120.9906 -166.5017 -145.2615
quadrupole: 13.7648 22.2282 1.8729
quadrupole: 23.2607 -22.2504 -1.0103 13.7648 22.2282 1.8729
hfenergy: -1186.5835223 hartree
pointgroup: C01 [X(C20H26N2O4)]
dipole: -0.759029 0.1530856 -2.4507469 debye
polarizability: 444.1401949|-9.6926204|168.2763603|4.3139398|20.1601355|218.7367576 unknown
InChI: InChI=1S/C20H26N2O4/c1-14(2)21-12-17(23)13-26-19-10-6-16(7-11-19)22-20(24)15-4-8-18(25-3)9-5-15/h4-11,14,17,21-23H,12-13H2,1-3H3
charge 0 multiplicity 1
52 atoms
O  3.618967 -0.852695 0.461213
O  6.01514 -2.200074 0.822241
O  -8.518047 -0.019711 -0.376936
O  -2.656446 0.112921 2.264119
N  6.511909 1.146126 -0.861247
N  -2.012545 -0.377976 0.059636
C  6.402415 0.19446 0.267282
C  5.889251 -1.179795 -0.228189
C  6.499666 2.596831 -0.51324
C  4.445253 -1.10466 -0.739407
C  7.058369 3.394881 -1.708866
C  5.0668 3.058264 -0.166759
C  2.227368 -0.742134 0.298236
C  1.481269 -0.512491 1.479055
C  1.559537 -0.841341 -0.94626
C  -0.598428 -0.486635 0.189803
C  0.082347 -0.382521 1.435958
C  0.15599 -0.714129 -0.989629
C  -4.394527 -0.14576 0.593021
C  -2.962971 -0.129953 1.053195
C  -5.348268 0.52806 1.405796
C  -4.852831 -0.819034 -0.567527
C  -7.146397 -0.108376 -0.118474
C  -6.705217 0.555262 1.056803
C  -6.217117 -0.8068 -0.930638
C  -9.033517 -0.691658 -1.573962
H  7.362086 0.023479 0.805696
H  5.680732 0.594403 1.001644
H  6.535673 -1.539449 -1.050488
H  7.153553 2.797414 0.372304
H  7.322689 0.921866 -1.455431
H  4.139693 -2.064939 -1.198928
H  4.348541 -0.268853 -1.458333
H  6.451631 3.199041 -2.612449
H  8.107804 3.116331 -1.926637
H  7.032958 4.479057 -1.501022
H  4.411638 2.946923 -1.049691
H  4.630457 2.462633 0.65486
H  5.06599 4.118488 0.147449
H  5.259855 -2.058637 1.451782
H  2.014521 -0.434327 2.431712
H  2.110664 -1.014002 -1.874475
H  -0.493547 -0.195535 2.343518
H  -0.355169 -0.794445 -1.958139
H  -2.365672 -0.449275 -0.896563
H  -4.991217 1.018902 2.316565
H  -4.163784 -1.407037 -1.187154
H  -7.444243 1.076687 1.672121
H  -6.541248 -1.347849 -1.824357
H  -8.571989 -0.282674 -2.493487
H  -8.864517 -1.784672 -1.524778
H  -10.113073 -0.483194 -1.576143
