program: Orca
programVersion: 5.0.2
elementType: O O O O O O O O O O O O O N N N N N C C C C C C C C C C C C C C C C C H H H H H H H H H H H H H H H H H H H H H H H H H
charge: 0
multiplicity: 1
keywords: wb97x-d3
keywords: def2-TZVPP
keywords: def2/J RIJCOSX
keywords: DEFGRID2
keywords: scfconv7
keywords: smallprint printgap noloewdin
keywords: NOSOSCF
formula: C17H25N5O13
InChI: InChI=1/C17H25N5O13/c18-6(8(25)5(24)3-34-16(19)32)13(29)20-7(15(30)31)11-9(26)10(27)14(35-11)22-1-4(2-23)12(28)21-17(22)33/h1,5-11,14,20-21,23-27,30H,2-3,18-19H2
60 atoms
O  -2.57544 -1.000801 1.383348
O  -4.120487 1.358925 2.476169
O  -1.631683 2.071266 2.847908
O  -5.637554 -0.176791 -1.241477
O  -4.422169 1.480018 -2.116066
O  0.664627 0.709919 3.180542
O  -1.090939 -1.522136 -1.946322
O  1.17624 0.819236 -0.380947
O  2.507106 2.431492 -2.130142
O  3.383333 -2.318932 1.236313
O  1.343435 -3.147068 -1.584281
O  4.056843 -0.051822 -0.887845
O  4.493873 2.080292 -0.302958
N  -0.30874 -0.852109 1.836639
N  -2.106585 0.37871 -1.244761
N  1.967229 -0.846323 2.199022
N  -0.460475 1.968202 -2.507002
N  4.883839 0.353338 1.114647
C  -3.506929 -0.138819 0.749844
C  -3.285754 1.239538 1.362319
C  -1.814752 1.190235 1.788437
C  -1.645434 -0.303972 2.14394
C  -3.327101 -0.204737 -0.778785
C  -4.500451 0.475885 -1.466753
C  -0.133448 -1.932687 1.017806
C  0.765167 -0.258034 2.444059
C  -1.128635 -0.303478 -1.859613
C  -0.043326 0.578398 -2.478011
C  1.274513 0.381461 -1.709526
C  1.062702 -2.483139 0.738383
C  2.454274 1.061244 -2.440998
C  2.243083 -1.920641 1.359973
C  1.185157 -3.598492 -0.26367
C  3.764404 0.316546 -2.227819
C  4.475985 0.889759 -0.047533
H  -4.50989 -0.496533 0.993896
H  -3.463713 2.049828 0.63935
H  -1.165608 1.419471 0.934675
H  -1.830681 -0.461622 3.213928
H  -3.330327 -1.261398 -1.063397
H  -2.022084 1.386852 -1.332774
H  -3.665522 1.925743 3.110871
H  -0.75991 1.867327 3.222368
H  -1.036111 -2.331946 0.584207
H  0.12204 0.153679 -3.478794
H  1.466355 -0.692749 -1.670525
H  2.760364 -0.375145 2.610715
H  2.274861 0.97552 -3.521741
H  -6.364462 0.302241 -1.662402
H  -1.0441 2.159296 -3.309113
H  0.324455 2.6051 -2.53747
H  0.312493 -4.257295 -0.165593
H  2.06337 -4.198929 -0.028122
H  3.7037 -0.637344 -2.751402
H  4.592991 0.885438 -2.6622
H  1.246592 1.780673 -0.383695
H  3.246261 2.577393 -1.511157
H  0.523088 -2.708908 -1.85009
H  4.884419 -0.647322 1.247392
H  5.310568 0.952551 1.796354
totalener: -1914.90308995 hartree
nucrepener: 4543.54067332 hartree
electener: -6458.44376327 hartree
twoeener: 5211.27836718 hartree
kineticenergy: 1907.43835108 hartree
xcener: -172.936544988817 hartree
chargesum: 0.0000000
charge: -0.356902 -0.358541 -0.397505 -0.254234 -0.335470 -0.463658 -0.483497 -0.376011 -0.432292 -0.415161 -0.366379 -0.258675 -0.451380 -0.028899 -0.188241 -0.120020 -0.394202 -0.336471 0.205184 0.067035 0.105888 0.105472 -0.011622 0.318405 0.002612 0.380968 0.282346 0.067653 0.172415 -0.131154 0.092997 0.253719 0.060282 -0.035802 0.478282 0.118314 0.090692 0.055446 0.121104 0.117344 0.180347 0.205039 0.234767 0.133345 0.112850 0.061976 0.156522 0.082118 0.209328 0.132299 0.151890 0.088330 0.093110 0.108705 0.122599 0.189250 0.232642 0.213133 0.216809 0.174901
qa: -0.3569 -0.3585 -0.3975 -0.2542 -0.3355 -0.4637 -0.4835 -0.3760 -0.4323 -0.4152 -0.3664 -0.2587 -0.4514 -0.0289 -0.1882 -0.1200 -0.3942 -0.3365 0.2052 0.0670 0.1059 0.1055 -0.0116 0.3184 0.0026 0.3810 0.2823 0.0677 0.1724 -0.1312 0.0930 0.2537 0.0603 -0.0358 0.4783 0.1183 0.0907 0.0554 0.1211 0.1173 0.1803 0.2050 0.2348 0.1333 0.1128 0.0620 0.1565 0.0821 0.2093 0.1323 0.1519 0.0883 0.0931 0.1087 0.1226 0.1892 0.2326 0.2131 0.2168 0.1749
va: 2.0460 2.1041 2.0413 2.2220 2.1509 2.0458 2.0275 2.0463 2.0071 2.1050 2.0446 2.1052 2.0512 3.2278 3.1845 3.2008 3.0137 3.2027 3.7056 4.0293 3.9452 3.8593 3.8625 4.3230 3.9241 4.3131 4.1639 3.9109 3.6735 3.5263 3.9699 4.2701 3.9779 3.9007 4.3525 1.0255 1.0216 1.0789 1.0165 1.0536 1.0558 1.0602 1.0598 1.0408 1.0149 1.0977 1.0525 1.0097 1.0383 1.0280 1.0592 0.9852 0.9996 1.0024 1.0031 1.0646 1.0750 1.0636 1.0197 1.0197
dispcorr: -0.047151241 hartree
energy: -1914.950241191067
dipole: 3.23339 -3.87307 -0.63968 2.80722 -2.57287 0.23435 -8.89494 8.41439 -0.48055
magnitude: 0.83369 au
magnitude: 2.11908 debye
