program: Orca
programVersion: 5.0.2
elementType: Cl O O O O N C C C C C C C C C C C C C C C C C C C C C C C H H H H H H H H H H H H H H H H H H H H H H
charge: 0
multiplicity: 1
keywords: wb97x-d3
keywords: def2-TZVPP
keywords: def2/J RIJCOSX
keywords: DEFGRID2
keywords: scfconv7
keywords: smallprint printgap noloewdin
keywords: NOSOSCF
formula: C23H22ClNO4
InChI: InChI=1/C23H22ClNO4/c1-4-14-28-20-11-6-17(16-21(20)27-3)12-13-25-23(26)22(29-15-5-2)18-7-9-19(24)10-8-18/h1-2,6-11,16,22,25H,12-15H2,3H3
51 atoms
Cl 3.053728 -2.605078 -0.098886
O  -3.3974 -1.322272 -1.073789
O  1.790144 1.058654 1.974045
O  -2.717676 0.56216 1.854521
O  3.368602 0.727143 -0.019333
N  -2.947847 1.251348 -0.296113
C  -1.630654 3.254912 -0.863027
C  -2.800407 2.672807 -0.076193
C  -0.312776 2.553415 -0.661954
C  -2.773594 -1.125597 0.170654
C  -2.836722 0.326998 0.654443
C  -1.30886 -1.48981 0.077011
C  0.108567 2.145296 0.608448
C  0.522245 2.31448 -1.738432
C  1.326727 1.514681 0.790074
C  2.182041 1.314273 -0.309908
C  1.76805 1.710484 -1.56711
C  -0.614201 -1.424195 -1.125858
C  -0.625666 -1.86012 1.23108
C  0.731333 -1.757892 -1.182726
C  0.721633 -2.182941 1.190723
C  1.386044 -2.143097 -0.024433
C  -4.735722 -1.768267 -0.995222
C  4.254857 0.485363 -1.093829
C  0.946246 1.16479 3.104787
C  -5.636804 -0.805735 -0.364021
C  5.457584 -0.128716 -0.553379
C  -6.371944 -0.018108 0.168228
C  6.465064 -0.626085 -0.131133
H  -1.545232 4.308781 -0.581777
H  -1.873581 3.247425 -1.928182
H  -2.679739 2.845949 0.990692
H  -3.71602 3.188155 -0.372706
H  -3.239725 -1.744575 0.94651
H  -3.049271 0.937682 -1.250526
H  -0.529375 2.32666 1.46299
H  0.215499 2.605223 -2.735573
H  2.392915 1.553329 -2.436136
H  -1.108334 -1.123239 -2.039692
H  -1.149395 -1.914187 2.177019
H  1.258448 -1.718064 -2.12635
H  1.236199 -2.479989 2.094245
H  -5.059994 -1.958701 -2.019263
H  -4.793891 -2.719017 -0.453507
H  3.805333 -0.177325 -1.841391
H  4.522143 1.418353 -1.603139
H  0.744092 2.206388 3.367293
H  -0.004828 0.647055 2.955894
H  1.475839 0.694053 3.929827
H  -7.03113 0.688615 0.621903
H  7.357775 -1.070925 0.248368
elementType: Cl O N C H
totalener: -1705.51823340 hartree
nucrepener: 3027.76802338 hartree
electener: -4733.28625678 hartree
oneelecener: -8356.19837723 hartree
twoeener: 3622.91212045 hartree
cpcmener: -0.05997700 hartree
kineticenergy: 1699.42125465 hartree
xcener: -141.298697138432 hartree
chargesum: 0.0000000
charge: -0.099181 -0.385874 -0.350502 -0.556737 -0.318380 -0.141432 -0.082470 -0.039104 -0.010841 0.341286 0.203864 0.116325 -0.223633 -0.266061 0.205179 0.220473 -0.145313 -0.260696 -0.254558 -0.167712 -0.185298 0.162565 0.031688 -0.113615 -0.132632 -0.430155 -0.473570 0.030467 0.198705 0.088540 0.091786 0.100974 0.108939 0.126698 0.178465 0.119791 0.136250 0.140049 0.144180 0.142174 0.145496 0.143725 0.125283 0.132317 0.132867 0.145389 0.125690 0.098866 0.128921 0.286440 0.284374
qa: -0.0992 -0.3859 -0.3505 -0.5567 -0.3184 -0.1414 -0.0825 -0.0391 -0.0108 0.3413 0.2039 0.1163 -0.2236 -0.2661 0.2052 0.2205 -0.1453 -0.2607 -0.2546 -0.1677 -0.1853 0.1626 0.0317 -0.1136 -0.1326 -0.4302 -0.4736 0.0305 0.1987 0.0885 0.0918 0.1010 0.1089 0.1267 0.1785 0.1198 0.1362 0.1400 0.1442 0.1422 0.1455 0.1437 0.1253 0.1323 0.1329 0.1454 0.1257 0.0989 0.1289 0.2864 0.2844
va: 1.2137 1.9471 2.0189 1.9463 2.0228 3.1964 3.8320 3.8390 3.7074 3.6124 4.2078 3.4916 3.8319 3.9497 3.8840 3.8721 3.8239 3.9883 3.9994 3.9264 3.9782 3.7150 3.9923 3.9494 3.8598 3.6756 3.9731 3.6254 3.3862 1.0072 1.0071 1.0213 1.0039 1.0096 1.0189 1.0319 1.0032 1.0071 1.0239 1.0203 1.0035 1.0067 0.9857 0.9859 0.9781 0.9855 0.9887 0.9929 0.9934 0.9460 0.9459
dispcorr: -0.034889606 hartree
energy: -1705.553123001936
dipole: -15.80307 13.88702 -1.91605 14.41189 -13.88515 0.52674 -0.53483 -1.47889 -2.01372
magnitude: 2.82909 au
magnitude: 7.19099 debye
