program: Orca
programVersion: 5.0.2
elementType: Cl O O O O N C C C C C C C C C C C C C C C C C C C C C C C H H H H H H H H H H H H H H H H H H H H H H
charge: 0
multiplicity: 1
keywords: wb97x-d3
keywords: def2-TZVPP
keywords: def2/J RIJCOSX
keywords: DEFGRID2
keywords: scfconv7
keywords: smallprint printgap noloewdin
keywords: NOSOSCF
formula: C23H22ClNO4
InChI: InChI=1/C23H22ClNO4/c1-4-14-28-20-11-6-17(16-21(20)27-3)12-13-25-23(26)22(29-15-5-2)18-7-9-19(24)10-8-18/h1-2,6-11,16,22,25H,12-15H2,3H3
51 atoms
Cl 3.097719 -2.584441 0.872763
O  -3.246831 -1.290743 -0.581437
O  1.913257 1.270982 1.963836
O  -2.633282 0.983723 2.078059
O  3.449713 0.710789 -0.008194
N  -2.843632 1.360808 -0.151652
C  -1.516328 3.245132 -1.0252
C  -2.670692 2.797677 -0.13552
C  -0.20261 2.55261 -0.77123
C  -2.683314 -0.928743 0.652785
C  -2.736912 0.580526 0.922368
C  -1.230896 -1.340265 0.682384
C  0.22837 2.25213 0.525193
C  0.620014 2.213793 -1.83087
C  1.439709 1.620683 0.748221
C  2.275443 1.304572 -0.339127
C  1.857455 1.606322 -1.620926
C  -0.622912 -1.607889 1.904268
C  -0.471667 -1.422861 -0.480107
C  0.713251 -1.96988 1.972126
C  0.862148 -1.800656 -0.427775
C  1.443826 -2.075782 0.799303
C  -4.659865 -1.379431 -0.53567
C  4.428443 0.531435 -1.009267
C  1.119933 1.563922 3.097962
C  -5.160204 -1.541638 -1.89172
C  4.124377 -0.552933 -1.940254
C  -5.59192 -1.667264 -3.004909
C  3.897636 -1.440263 -2.717849
H  -1.406893 4.325306 -0.89031
H  -1.791645 3.101003 -2.072559
H  -2.518272 3.114815 0.893605
H  -3.585982 3.283612 -0.478029
H  -3.207441 -1.418939 1.482937
H  -2.887914 0.911034 -1.055345
H  -0.394935 2.52029 1.367565
H  0.308108 2.42535 -2.846194
H  2.469564 1.369333 -2.480712
H  -1.197002 -1.548745 2.820221
H  -0.906155 -1.205431 -1.446519
H  1.169701 -2.180885 2.929591
H  1.436802 -1.878799 -1.34053
H  -4.972773 -2.230209 0.080553
H  -5.110975 -0.483718 -0.093625
H  4.602358 1.459244 -1.565243
H  5.352937 0.297143 -0.479841
H  1.659347 1.177369 3.959772
H  0.976916 2.64011 3.227377
H  0.140405 1.080798 3.051709
H  -5.974215 -1.781861 -3.994695
H  3.685965 -2.226637 -3.407456
elementType: Cl O N C H
totalener: -1705.51837905 hartree
nucrepener: 3035.01487415 hartree
electener: -4740.53325320 hartree
oneelecener: -8370.55779257 hartree
twoeener: 3630.02453938 hartree
cpcmener: -0.05694800 hartree
kineticenergy: 1699.41665890 hartree
xcener: -141.298157228775 hartree
chargesum: -0.0000000
charge: -0.095532 -0.370869 -0.346790 -0.555257 -0.320802 -0.154490 -0.077702 -0.044545 -0.024135 0.291747 0.235869 0.151367 -0.224215 -0.261325 0.210765 0.208575 -0.141224 -0.263841 -0.301154 -0.163206 -0.111737 0.097058 -0.022380 0.015493 -0.134038 -0.457074 -0.407932 0.119181 0.005561 0.088342 0.093017 0.103232 0.108560 0.119163 0.179239 0.117928 0.137076 0.142118 0.142972 0.141517 0.143288 0.161195 0.124503 0.124331 0.148509 0.137458 0.130045 0.127491 0.098324 0.285952 0.288373
qa: -0.0955 -0.3709 -0.3468 -0.5553 -0.3208 -0.1545 -0.0777 -0.0445 -0.0241 0.2917 0.2359 0.1514 -0.2242 -0.2613 0.2108 0.2086 -0.1412 -0.2638 -0.3012 -0.1632 -0.1117 0.0971 -0.0224 0.0155 -0.1340 -0.4571 -0.4079 0.1192 0.0056 0.0883 0.0930 0.1032 0.1086 0.1192 0.1792 0.1179 0.1371 0.1421 0.1430 0.1415 0.1433 0.1612 0.1245 0.1243 0.1485 0.1375 0.1300 0.1275 0.0983 0.2860 0.2884
va: 1.2119 1.9574 2.0226 1.9536 2.0365 3.2227 3.8202 3.8513 3.7284 3.7287 4.2220 3.4090 3.8127 3.9861 3.8919 3.8447 3.8422 3.9985 4.0400 3.9560 3.8396 3.7758 4.0181 3.9219 3.8569 3.8448 3.6056 3.4859 3.6612 1.0071 1.0056 1.0198 1.0025 1.0137 1.0171 1.0353 1.0030 1.0029 1.0181 1.0281 1.0061 0.9869 0.9867 0.9811 0.9874 0.9877 0.9930 0.9897 0.9911 0.9451 0.9455
dispcorr: -0.035089588 hartree
energy: -1705.553468635582
dipole: -15.34588 13.71906 -1.62681 15.57570 -14.72721 0.84849 -3.52660 1.86407 -1.66253
magnitude: 2.47598 au
magnitude: 6.29343 debye
