program: Orca
programVersion: 5.0.2
elementType: Cl O O O O N C C C C C C C C C C C C C C C C C C C C C C C H H H H H H H H H H H H H H H H H H H H H H
charge: 0
multiplicity: 1
keywords: wb97x-d3
keywords: def2-TZVPP
keywords: def2/J RIJCOSX
keywords: DEFGRID2
keywords: scfconv7
keywords: smallprint printgap noloewdin
keywords: NOSOSCF
formula: C23H22ClNO4
InChI: InChI=1/C23H22ClNO4/c1-4-14-28-20-11-6-17(16-21(20)27-3)12-13-25-23(26)22(29-15-5-2)18-7-9-19(24)10-8-18/h1-2,6-11,16,22,25H,12-15H2,3H3
51 atoms
Cl 2.039114 -2.855849 2.768672
O  -3.1372 -0.724898 -0.906737
O  2.602479 0.572978 1.326845
O  -2.744545 1.646006 1.676504
O  3.119268 -0.088504 -1.099643
N  -2.662461 1.820324 -0.576357
C  -1.014321 3.632607 -0.040835
C  -2.368214 3.237451 -0.639134
C  0.09386 2.672435 -0.373941
C  -2.922208 -0.376297 0.436411
C  -2.769969 1.138637 0.558279
C  -1.684189 -1.028355 1.012621
C  0.827204 2.079963 0.655656
C  0.396335 2.33297 -1.682117
C  1.84711 1.18073 0.388039
C  2.13207 0.834383 -0.942998
C  1.405595 1.416436 -1.967147
C  -0.586651 -1.305279 0.204425
C  -1.617871 -1.32409 2.368718
C  0.55596 -1.881413 0.737169
C  -0.475661 -1.885597 2.918822
C  0.602557 -2.161398 2.092907
C  -3.610176 -2.047143 -1.075418
C  3.43644 -0.530267 -2.402981
C  2.313235 0.835956 2.686485
C  -3.709348 -2.321658 -2.500487
C  4.180682 0.465977 -3.169257
C  -3.785483 -2.564569 -3.673934
C  4.808727 1.267911 -3.80561
H  -1.096569 3.725736 1.041894
H  -0.779897 4.63308 -0.413841
H  -3.159154 3.808142 -0.149946
H  -2.401619 3.503046 -1.69347
H  -3.790978 -0.64914 1.051709
H  -2.633828 1.300589 -1.438995
H  0.583033 2.335972 1.678792
H  -0.152923 2.774875 -2.504645
H  1.6033 1.173277 -3.002446
H  -0.608827 -1.077983 -0.853841
H  -2.467252 -1.124521 3.009927
H  1.401612 -2.100071 0.099755
H  -0.433061 -2.1076 3.976422
H  -2.936193 -2.778594 -0.615152
H  -4.591526 -2.170835 -0.602055
H  4.054872 -1.418905 -2.271855
H  2.542958 -0.842132 -2.953552
H  1.290004 0.555425 2.949523
H  3.00299 0.23305 3.271908
H  2.467257 1.888395 2.938414
H  -3.8531 -2.778469 -4.717344
H  5.365042 1.982412 -4.37047
elementType: Cl O N C H
totalener: -1705.51828739 hartree
nucrepener: 2988.37850523 hartree
electener: -4693.89679262 hartree
oneelecener: -8276.46948336 hartree
twoeener: 3582.57269074 hartree
cpcmener: -0.05732032 hartree
kineticenergy: 1699.43561464 hartree
xcener: -141.299692483981 hartree
chargesum: -0.0000000
charge: -0.101693 -0.378514 -0.342863 -0.565783 -0.333289 -0.157522 -0.088367 -0.079666 -0.008821 0.310018 0.241440 0.094164 -0.193041 -0.297408 0.217091 0.212934 -0.147311 -0.252939 -0.235755 -0.123356 -0.142055 0.074455 -0.020680 0.017182 -0.144675 -0.462950 -0.435786 0.118266 0.051526 0.086072 0.101344 0.114909 0.118198 0.122582 0.187194 0.125528 0.141830 0.138193 0.142281 0.143636 0.143906 0.142803 0.129539 0.124446 0.134784 0.142985 0.103750 0.124166 0.134393 0.286255 0.286608
qa: -0.1017 -0.3785 -0.3429 -0.5658 -0.3333 -0.1575 -0.0884 -0.0797 -0.0088 0.3100 0.2414 0.0942 -0.1930 -0.2974 0.2171 0.2129 -0.1473 -0.2529 -0.2358 -0.1234 -0.1421 0.0745 -0.0207 0.0172 -0.1447 -0.4630 -0.4358 0.1183 0.0515 0.0861 0.1013 0.1149 0.1182 0.1226 0.1872 0.1255 0.1418 0.1382 0.1423 0.1436 0.1439 0.1428 0.1295 0.1244 0.1348 0.1430 0.1038 0.1242 0.1344 0.2863 0.2866
va: 1.2023 1.9261 2.0274 1.9412 2.0388 3.1993 3.7592 3.8698 3.7080 3.6908 4.2977 3.3564 3.8012 4.0102 3.8776 3.8579 3.8425 3.9739 4.0800 3.8663 3.9318 3.7792 4.0075 3.9433 3.8667 3.8595 3.7322 3.4808 3.6167 1.0281 1.0093 1.0067 0.9966 1.0078 1.0184 1.0195 1.0008 1.0050 1.0199 1.0125 1.0195 1.0061 0.9774 0.9869 0.9871 0.9840 0.9819 0.9980 0.9924 0.9450 0.9455
dispcorr: -0.033118932 hartree
energy: -1705.551406321743
dipole: -9.05485 7.81143 -1.24341 13.97509 -14.19554 -0.22045 -9.01221 7.14366 -1.86855
magnitude: 2.25525 au
magnitude: 5.73240 debye
