program: Orca
programVersion: 5.0.2
elementType: Cl O O O O N C C C C C C C C C C C C C C C C C C C C C C C H H H H H H H H H H H H H H H H H H H H H H
charge: 0
multiplicity: 1
keywords: wb97x-d3
keywords: def2-TZVPP
keywords: def2/J RIJCOSX
keywords: DEFGRID2
keywords: scfconv7
keywords: smallprint printgap noloewdin
keywords: NOSOSCF
formula: C23H22ClNO4
InChI: InChI=1/C23H22ClNO4/c1-4-14-28-20-11-6-17(16-21(20)27-3)12-13-25-23(26)22(29-15-5-2)18-7-9-19(24)10-8-18/h1-2,6-11,16,22,25H,12-15H2,3H3
51 atoms
Cl 2.603772 -2.881831 1.063173
O  -3.220804 -0.669067 -1.372304
O  2.184494 0.773127 1.805385
O  -2.824398 1.377728 1.446793
O  3.253683 0.622539 -0.527741
N  -2.687817 1.846392 -0.761098
C  -1.381493 3.779377 0.196221
C  -2.561016 3.287178 -0.649343
C  -0.118235 2.996566 -0.024753
C  -2.803251 -0.47602 -0.042759
C  -2.778999 1.017869 0.273583
C  -1.433643 -1.060992 0.228988
C  0.443148 2.269156 1.027308
C  0.494382 2.94974 -1.265343
C  1.581915 1.502668 0.843511
C  2.173016 1.437937 -0.429151
C  1.633637 2.174702 -1.469078
C  -1.136786 -1.575441 1.485251
C  -0.455146 -1.087945 -0.759656
C  0.108041 -2.124154 1.754939
C  0.78751 -1.650407 -0.51073
C  1.058528 -2.16323 0.748001
C  -3.538627 -2.005449 -1.702642
C  3.726573 0.325384 -1.828436
C  1.610272 0.766916 3.098105
C  -4.738282 -2.475371 -1.012389
C  4.615931 -0.821358 -1.727216
C  -5.720954 -2.846679 -0.428876
C  5.333134 -1.782314 -1.674196
H  -1.641342 3.762819 1.253682
H  -1.230176 4.830095 -0.063467
H  -3.484815 3.719188 -0.258842
H  -2.455035 3.650486 -1.669258
H  -3.521457 -0.919659 0.658948
H  -2.63209 1.448692 -1.684986
H  -0.032448 2.310011 1.998797
H  0.090258 3.515517 -2.096116
H  2.085657 2.161582 -2.45197
H  -1.887929 -1.566563 2.265401
H  -0.653535 -0.687447 -1.745573
H  0.324946 -2.524037 2.736098
H  1.530859 -1.692296 -1.295618
H  -3.700823 -2.028597 -2.7811
H  -2.707382 -2.686185 -1.489128
H  2.901483 0.077796 -2.505315
H  4.258475 1.179852 -2.260899
H  2.208526 0.084131 3.697061
H  1.637945 1.757318 3.559953
H  0.577807 0.409747 3.089147
H  -6.600652 -3.179798 0.075348
H  5.954228 -2.64837 -1.617262
elementType: Cl O N C H
totalener: -1705.51745910 hartree
nucrepener: 3026.20247611 hartree
electener: -4731.71993521 hartree
oneelecener: -8352.68260375 hartree
twoeener: 3620.96266854 hartree
cpcmener: -0.06088694 hartree
kineticenergy: 1699.43060415 hartree
xcener: -141.298821325611 hartree
chargesum: 0.0000000
charge: -0.094972 -0.376464 -0.343104 -0.565150 -0.331581 -0.154177 -0.081307 -0.092265 -0.005497 0.264284 0.270608 0.149962 -0.201564 -0.284547 0.214803 0.197654 -0.144440 -0.255158 -0.323704 -0.160905 -0.073953 0.083416 0.017576 -0.071095 -0.140074 -0.436426 -0.455266 0.039493 0.154694 0.086906 0.101735 0.116250 0.118926 0.127476 0.185376 0.124625 0.141202 0.142550 0.142244 0.140967 0.148694 0.147884 0.131468 0.136612 0.132857 0.141420 0.125799 0.131503 0.106358 0.286227 0.282080
qa: -0.0950 -0.3765 -0.3431 -0.5652 -0.3316 -0.1542 -0.0813 -0.0923 -0.0055 0.2643 0.2706 0.1500 -0.2016 -0.2845 0.2148 0.1977 -0.1444 -0.2552 -0.3237 -0.1609 -0.0740 0.0834 0.0176 -0.0711 -0.1401 -0.4364 -0.4553 0.0395 0.1547 0.0869 0.1017 0.1163 0.1189 0.1275 0.1854 0.1246 0.1412 0.1425 0.1422 0.1410 0.1487 0.1479 0.1315 0.1366 0.1329 0.1414 0.1258 0.1315 0.1064 0.2862 0.2821
va: 1.2148 1.9467 2.0354 1.9388 2.0247 3.1968 3.7570 3.8714 3.6737 3.6775 4.2630 3.2894 3.8326 3.9787 3.8982 3.8932 3.8279 4.0337 4.0271 3.8988 3.8018 3.7931 3.9917 3.9793 3.8618 3.7505 3.9194 3.6160 3.4432 1.0271 1.0090 1.0043 0.9959 1.0150 1.0147 1.0264 1.0017 1.0054 1.0112 1.0232 1.0027 0.9936 0.9844 0.9826 0.9756 0.9824 0.9938 0.9907 0.9841 0.9458 0.9475
dispcorr: -0.034917511 hartree
energy: -1705.552376611427
dipole: -11.87825 10.81840 -1.05985 14.31293 -14.11741 0.19552 -3.81732 1.57519 -2.24212
magnitude: 2.48769 au
magnitude: 6.32321 debye
