program: Orca
programVersion: 5.0.2
elementType: Cl O O O O N C C C C C C C C C C C C C C C C C C C C C C C H H H H H H H H H H H H H H H H H H H H H H
charge: 0
multiplicity: 1
keywords: wb97x-d3
keywords: def2-TZVPP
keywords: def2/J RIJCOSX
keywords: DEFGRID2
keywords: scfconv7
keywords: smallprint printgap noloewdin
keywords: NOSOSCF
formula: C23H22ClNO4
InChI: InChI=1/C23H22ClNO4/c1-4-14-28-20-11-6-17(16-21(20)27-3)12-13-25-23(26)22(29-15-5-2)18-7-9-19(24)10-8-18/h1-2,6-11,16,22,25H,12-15H2,3H3
51 atoms
Cl 2.800008 -2.717551 0.931376
O  -3.442493 -0.793026 -0.584393
O  1.956626 1.169837 1.950675
O  -2.558832 1.240983 2.137741
O  3.402668 0.568017 -0.076218
N  -2.833108 1.727994 -0.061716
C  -1.361364 3.531919 -0.880368
C  -2.535951 3.142996 0.010834
C  -0.104762 2.724426 -0.682644
C  -2.827544 -0.596334 0.662038
C  -2.742831 0.895234 0.973093
C  -1.417006 -1.146418 0.716004
C  0.330807 2.34523 0.591459
C  0.662308 2.356303 -1.774067
C  1.490235 1.60863 0.761596
C  2.273318 1.267019 -0.356433
C  1.8514 1.645463 -1.616038
C  -0.623442 -1.189202 -0.42533
C  -0.883424 -1.572648 1.926495
C  0.674506 -1.672751 -0.366492
C  0.419188 -2.041508 2.004153
C  1.185903 -2.093657 0.85079
C  -3.825456 -2.136321 -0.809953
C  4.331335 0.331339 -1.11238
C  1.197761 1.453144 3.110528
C  -4.422049 -2.231149 -2.133036
C  3.90335 -0.69965 -2.054564
C  -4.918145 -2.325196 -3.222562
C  3.574592 -1.547635 -2.839311
H  -1.160751 4.592335 -0.700527
H  -1.663447 3.458794 -1.92773
H  -2.341778 3.401697 1.0487
H  -3.411965 3.717852 -0.293863
H  -3.423228 -1.052645 1.463537
H  -2.954485 1.331097 -0.982076
H  -0.247772 2.633607 1.458731
H  0.344724 2.62646 -2.773579
H  2.422281 1.390106 -2.498622
H  -1.009526 -0.85407 -1.379509
H  -1.488782 -1.549876 2.823934
H  1.278921 -1.714216 -1.26212
H  0.822592 -2.371044 2.951917
H  -2.967802 -2.816255 -0.753375
H  -4.546308 -2.464725 -0.051773
H  4.564649 1.2536 -1.655309
H  5.249475 0.008873 -0.619988
H  1.717001 0.980768 3.941002
H  1.132953 2.527296 3.302932
H  0.186511 1.043494 3.050414
H  -5.354638 -2.399839 -4.193612
H  3.280286 -2.306561 -3.5293
elementType: Cl O N C H
totalener: -1705.51890967 hartree
nucrepener: 3041.21461542 hartree
electener: -4746.73352509 hartree
oneelecener: -8382.85756320 hartree
twoeener: 3636.12403811 hartree
cpcmener: -0.05503356 hartree
kineticenergy: 1699.42676698 hartree
xcener: -141.301446302554 hartree
chargesum: 0.0000000
charge: -0.095276 -0.380231 -0.346993 -0.563174 -0.321498 -0.159518 -0.080604 -0.035299 -0.017939 0.311146 0.251138 0.147734 -0.234734 -0.265675 0.227847 0.196955 -0.132381 -0.324035 -0.288288 -0.068851 -0.138535 0.061467 -0.026039 0.014732 -0.133068 -0.461906 -0.416059 0.123244 0.017211 0.087650 0.092526 0.101369 0.111049 0.121605 0.175353 0.119193 0.136569 0.140154 0.140398 0.142511 0.159646 0.142828 0.129630 0.124802 0.148023 0.137565 0.129189 0.128042 0.096347 0.285890 0.288292
qa: -0.0953 -0.3802 -0.3470 -0.5632 -0.3215 -0.1595 -0.0806 -0.0353 -0.0179 0.3111 0.2511 0.1477 -0.2347 -0.2657 0.2278 0.1970 -0.1324 -0.3240 -0.2883 -0.0689 -0.1385 0.0615 -0.0260 0.0147 -0.1331 -0.4619 -0.4161 0.1232 0.0172 0.0876 0.0925 0.1014 0.1110 0.1216 0.1754 0.1192 0.1366 0.1402 0.1404 0.1425 0.1596 0.1428 0.1296 0.1248 0.1480 0.1376 0.1292 0.1280 0.0963 0.2859 0.2883
va: 1.2134 1.9346 2.0255 1.9402 2.0362 3.2447 3.8341 3.8453 3.7129 3.6716 4.2896 3.2983 3.8202 3.9894 3.8778 3.8625 3.8392 4.0178 4.0298 3.7852 3.9226 3.8058 4.0156 3.9225 3.8571 3.8610 3.6178 3.4789 3.6475 1.0074 1.0063 1.0213 1.0030 1.0131 1.0229 1.0343 1.0032 1.0033 1.0262 1.0148 0.9872 1.0060 0.9778 0.9861 0.9872 0.9879 0.9933 0.9894 0.9920 0.9451 0.9455
dispcorr: -0.035151657 hartree
energy: -1705.554061324977
dipole: -12.50021 11.42661 -1.07360 14.46742 -14.18608 0.28134 -3.82393 2.03965 -1.78428
magnitude: 2.10129 au
magnitude: 5.34105 debye
