program: Orca
programVersion: 5.0.2
elementType: Cl O O O O N C C C C C C C C C C C C C C C C C C C C C C C H H H H H H H H H H H H H H H H H H H H H H
charge: 0
multiplicity: 1
keywords: wb97x-d3
keywords: def2-TZVPP
keywords: def2/J RIJCOSX
keywords: DEFGRID2
keywords: scfconv7
keywords: smallprint printgap noloewdin
keywords: NOSOSCF
formula: C23H22ClNO4
InChI: InChI=1/C23H22ClNO4/c1-4-14-28-20-11-6-17(16-21(20)27-3)12-13-25-23(26)22(29-15-5-2)18-7-9-19(24)10-8-18/h1-2,6-11,16,22,25H,12-15H2,3H3
51 atoms
Cl 2.730968 -3.107839 -0.07856
O  -3.377755 -0.421949 -0.69236
O  1.841576 1.063591 -2.33671
O  -2.013798 0.866163 2.297539
O  3.143874 0.577502 -0.176817
N  -2.872183 1.878416 0.458416
C  -1.461897 3.861735 0.034423
C  -2.595767 3.243391 0.851078
C  -0.217863 3.01612 0.018693
C  -2.686658 -0.553288 0.522655
C  -2.493088 0.817481 1.16831
C  -1.330168 -1.204414 0.35401
C  0.220357 2.444408 -1.177831
C  0.495589 2.755457 1.175995
C  1.349462 1.643433 -1.220928
C  2.05757 1.379064 -0.036531
C  1.620068 1.933888 1.153248
C  -0.640313 -1.126862 -0.850324
C  -0.744568 -1.872518 1.424022
C  0.605211 -1.7211 -0.99381
C  0.509679 -2.449354 1.303857
C  1.172306 -2.371325 0.088947
C  -3.944989 -1.619406 -1.183221
C  3.867254 0.247844 0.993498
C  1.104155 1.195083 -3.536864
C  -5.082516 -2.062893 -0.379731
C  5.034376 -0.525795 0.598784
C  -6.01196 -2.425826 0.289851
C  6.013036 -1.15265 0.298845
H  -1.253964 4.848946 0.454796
H  -1.803518 4.026517 -0.989663
H  -2.355262 3.256452 1.911392
H  -3.49973 3.840127 0.72493
H  -3.273775 -1.138759 1.244021
H  -3.215407 1.726013 -0.478107
H  -0.340827 2.641744 -2.082457
H  0.182782 3.185386 2.119489
H  2.142337 1.743731 2.081235
H  -1.067656 -0.611356 -1.70065
H  -1.273209 -1.957906 2.364769
H  1.123895 -1.672887 -1.941311
H  0.954828 -2.963855 2.144483
H  -4.273628 -1.413274 -2.202711
H  -3.20445 -2.424423 -1.242698
H  4.199195 1.147575 1.523079
H  3.250397 -0.33282 1.688991
H  1.637027 0.620734 -4.290979
H  0.091493 0.794333 -3.440933
H  1.042914 2.234796 -3.867943
H  -6.83847 -2.746087 0.884484
H  6.877493 -1.71528 0.025177
elementType: Cl O N C H
totalener: -1705.51926772 hartree
nucrepener: 3009.82024658 hartree
electener: -4715.33951430 hartree
oneelecener: -8320.01901969 hartree
twoeener: 3604.67950538 hartree
cpcmener: -0.06228348 hartree
kineticenergy: 1699.43507053 hartree
xcener: -141.300341456939 hartree
chargesum: -0.0000000
charge: -0.100868 -0.385210 -0.348439 -0.564363 -0.326747 -0.158902 -0.094138 -0.044851 0.033680 0.282295 0.257624 0.135106 -0.230789 -0.309835 0.232087 0.209263 -0.146046 -0.264661 -0.248681 -0.150479 -0.156717 0.110102 0.016603 -0.088315 -0.136680 -0.448986 -0.476986 0.057161 0.192325 0.095951 0.090391 0.100516 0.109438 0.125397 0.178264 0.126635 0.141921 0.140811 0.151841 0.141548 0.140335 0.144077 0.130669 0.135839 0.143562 0.127770 0.128204 0.108272 0.123310 0.286515 0.284178
qa: -0.1009 -0.3852 -0.3484 -0.5644 -0.3267 -0.1589 -0.0941 -0.0449 0.0337 0.2823 0.2576 0.1351 -0.2308 -0.3098 0.2321 0.2093 -0.1460 -0.2647 -0.2487 -0.1505 -0.1567 0.1101 0.0166 -0.0883 -0.1367 -0.4490 -0.4770 0.0572 0.1923 0.0960 0.0904 0.1005 0.1094 0.1254 0.1783 0.1266 0.1419 0.1408 0.1518 0.1415 0.1403 0.1441 0.1307 0.1358 0.1436 0.1278 0.1282 0.1083 0.1233 0.2865 0.2842
va: 1.2053 1.9250 2.0271 1.9380 2.0198 3.2259 3.8242 3.8474 3.6458 3.6539 4.2976 3.3632 3.8822 3.9432 3.8693 3.8762 3.8275 3.9711 4.0870 3.9101 3.9711 3.8087 3.9778 3.9539 3.8621 3.7845 3.9842 3.5964 3.3958 1.0110 1.0104 1.0233 1.0061 1.0038 1.0257 1.0175 1.0041 1.0077 1.0183 1.0163 1.0164 1.0052 0.9849 0.9819 0.9840 0.9772 0.9925 0.9857 0.9893 0.9453 0.9461
dispcorr: -0.033573188 hartree
energy: -1705.552840911744
dipole: -13.96498 11.91151 -2.05347 16.29774 -15.55980 0.73794 -4.41652 2.82692 -1.58960
magnitude: 2.69965 au
magnitude: 6.86197 debye
