program: Orca
programVersion: 5.0.2
elementType: Cl O O O O N C C C C C C C C C C C C C C C C C C C C C C C H H H H H H H H H H H H H H H H H H H H H H
charge: 0
multiplicity: 1
keywords: wb97x-d3
keywords: def2-TZVPP
keywords: def2/J RIJCOSX
keywords: DEFGRID2
keywords: scfconv7
keywords: smallprint printgap noloewdin
keywords: NOSOSCF
formula: C23H22ClNO4
InChI: InChI=1/C23H22ClNO4/c1-4-14-28-20-11-6-17(16-21(20)27-3)12-13-25-23(26)22(29-15-5-2)18-7-9-19(24)10-8-18/h1-2,6-11,16,22,25H,12-15H2,3H3
51 atoms
Cl 2.4467 -3.461136 -1.316546
O  -3.67615 -0.729564 -0.952424
O  2.273724 2.716644 2.555926
O  -1.788747 0.920871 1.516587
O  3.259949 0.695538 1.31597
N  -2.752982 1.67221 -0.392549
C  -1.123004 3.470443 -0.942123
C  -2.421391 3.073531 -0.237347
C  0.075819 2.741985 -0.407373
C  -2.725749 -0.719659 0.08211
C  -2.380785 0.720191 0.460674
C  -1.443423 -1.43391 -0.287664
C  0.632781 3.124241 0.817658
C  0.60484 1.646667 -1.06287
C  1.687724 2.423539 1.373091
C  2.219177 1.311235 0.69152
C  1.670104 0.930035 -0.517243
C  -1.000412 -1.480764 -1.604955
C  -0.669208 -2.020414 0.706054
C  0.190474 -2.112531 -1.929869
C  0.529309 -2.646436 0.399049
C  0.94625 -2.687717 -0.921433
C  -4.267731 -1.987975 -1.200623
C  3.75645 -0.509805 0.772721
C  1.715894 3.761172 3.330915
C  -5.143241 -2.413309 -0.110618
C  4.538184 -0.314107 -0.44578
C  -5.868868 -2.749684 0.786159
C  5.185482 -0.177009 -1.448215
H  -1.002421 4.549254 -0.817045
H  -1.226438 3.285764 -2.013473
H  -2.365702 3.311516 0.824039
H  -3.244976 3.656556 -0.648396
H  -3.136374 -1.176637 0.99244
H  -3.194492 1.396203 -1.256197
H  0.210956 3.976158 1.336634
H  0.192786 1.328974 -2.012328
H  2.052271 0.079282 -1.064765
H  -1.57876 -1.026527 -2.399034
H  -1.003197 -2.002225 1.735701
H  0.523318 -2.146637 -2.958231
H  1.122635 -3.100201 1.181313
H  -4.846928 -1.882848 -2.118956
H  -3.515115 -2.762211 -1.384502
H  4.394545 -0.942693 1.544045
H  2.94785 -1.223615 0.587907
H  0.672194 3.563733 3.588734
H  2.298907 3.810145 4.247615
H  1.779179 4.727596 2.824667
H  -6.516189 -3.061101 1.575506
H  5.750039 -0.048377 -2.344834
elementType: Cl O N C H
totalener: -1705.51975315 hartree
nucrepener: 2962.83529913 hartree
electener: -4668.35505228 hartree
oneelecener: -8226.20127327 hartree
twoeener: 3557.84622099 hartree
cpcmener: -0.06275485 hartree
kineticenergy: 1699.42641828 hartree
xcener: -141.299240764647 hartree
chargesum: -0.0000000
charge: -0.098897 -0.380893 -0.347879 -0.563864 -0.336328 -0.156214 -0.090747 -0.051491 0.008625 0.276676 0.257758 0.169544 -0.241686 -0.245590 0.206415 0.288054 -0.231816 -0.312991 -0.259677 -0.116902 -0.127578 0.071813 0.012434 0.103013 -0.129225 -0.439835 -0.457147 0.047582 0.031339 0.092814 0.091485 0.102652 0.111445 0.125690 0.180597 0.127620 0.143404 0.135675 0.146751 0.141749 0.146319 0.151398 0.131547 0.137984 0.136591 0.089810 0.113333 0.124498 0.111879 0.286116 0.286149
qa: -0.0989 -0.3809 -0.3479 -0.5639 -0.3363 -0.1562 -0.0907 -0.0515 0.0086 0.2767 0.2578 0.1695 -0.2417 -0.2456 0.2064 0.2881 -0.2318 -0.3130 -0.2597 -0.1169 -0.1276 0.0718 0.0124 0.1030 -0.1292 -0.4398 -0.4571 0.0476 0.0313 0.0928 0.0915 0.1027 0.1114 0.1257 0.1806 0.1276 0.1434 0.1357 0.1468 0.1417 0.1463 0.1514 0.1315 0.1380 0.1366 0.0898 0.1133 0.1245 0.1119 0.2861 0.2861
va: 1.2080 1.9418 2.0348 1.9354 2.0491 3.2213 3.8522 3.8438 3.6376 3.6814 4.2838 3.2589 3.8640 3.9709 3.9510 3.8180 3.8686 3.9977 4.0770 3.9225 3.8768 3.7952 3.9846 3.9290 3.8727 3.7590 3.6975 3.6135 3.6544 1.0126 1.0111 1.0181 1.0059 1.0110 1.0204 1.0166 1.0010 1.0035 1.0196 1.0153 1.0040 1.0015 0.9848 0.9818 0.9924 1.0224 0.9885 0.9934 0.9861 0.9457 0.9459
dispcorr: -0.032444500 hartree
energy: -1705.552197645744
dipole: -12.38459 10.16832 -2.21627 18.31342 -18.12657 0.18685 3.17019 -4.93411 -1.76392
magnitude: 2.83869 au
magnitude: 7.21538 debye
