program: Orca
programVersion: 5.0.2
elementType: Cl O O O O N C C C C C C C C C C C C C C C C C C C C C C C H H H H H H H H H H H H H H H H H H H H H H
charge: 0
multiplicity: 1
keywords: wb97x-d3
keywords: def2-TZVPP
keywords: def2/J RIJCOSX
keywords: DEFGRID2
keywords: scfconv7
keywords: smallprint printgap noloewdin
keywords: NOSOSCF
formula: C23H22ClNO4
InChI: InChI=1/C23H22ClNO4/c1-4-14-28-20-11-6-17(16-21(20)27-3)12-13-25-23(26)22(29-15-5-2)18-7-9-19(24)10-8-18/h1-2,6-11,16,22,25H,12-15H2,3H3
51 atoms
Cl 3.076521 -2.611404 1.33246
O  -2.988232 -1.719038 -1.17096
O  2.071828 0.940152 2.072859
O  -3.05198 0.880638 1.217614
O  3.510872 0.843125 -0.045576
N  -2.542303 0.986042 -0.985417
C  -1.622626 3.21501 -0.27738
C  -2.613701 2.424167 -1.137555
C  -0.244968 2.614866 -0.255816
C  -2.634655 -1.188262 0.085323
C  -2.78332 0.337228 0.149254
C  -1.196901 -1.537516 0.382224
C  0.255048 2.061477 0.924749
C  0.541635 2.567731 -1.394484
C  1.512304 1.481262 0.970221
C  2.296239 1.433879 -0.195406
C  1.804156 1.979183 -1.367891
C  -0.226191 -1.52068 -0.615714
C  -0.820996 -1.857362 1.680982
C  1.089366 -1.846892 -0.327676
C  0.493746 -2.178572 1.985378
C  1.437814 -2.177556 0.972547
C  -4.360513 -2.026572 -1.307668
C  4.401905 0.82365 -1.139915
C  1.348632 1.0019 3.287179
C  -5.237184 -0.859619 -1.220736
C  4.010707 -0.136266 -2.168815
C  -5.959674 0.096468 -1.131438
C  3.700796 -0.935104 -3.010746
H  -1.997865 3.306941 0.741113
H  -1.590175 4.228634 -0.684135
H  -3.629243 2.774686 -0.934486
H  -2.419749 2.621818 -2.190011
H  -3.269974 -1.601688 0.877941
H  -2.370574 0.439755 -1.814434
H  -0.358781 2.098715 1.815563
H  0.182125 2.991829 -2.324156
H  2.385642 1.963901 -2.279978
H  -0.479187 -1.261797 -1.635668
H  -1.562405 -1.873549 2.470112
H  1.83209 -1.841871 -1.114038
H  0.770216 -2.43172 2.999766
H  -4.475679 -2.501079 -2.283194
H  -4.66774 -2.757653 -0.551322
H  4.522635 1.818958 -1.579831
H  5.370516 0.53683 -0.729291
H  0.385972 0.489113 3.222018
H  1.959062 0.501042 4.035048
H  1.17842 2.033686 3.605796
H  -6.602272 0.944906 -1.05416
H  3.424306 -1.64089 -3.761677
elementType: Cl O N C H
totalener: -1705.51707214 hartree
nucrepener: 3040.03841631 hartree
electener: -4745.55548846 hartree
oneelecener: -8381.13845009 hartree
twoeener: 3635.58296163 hartree
cpcmener: -0.05985758 hartree
kineticenergy: 1699.43169428 hartree
xcener: -141.298838072484 hartree
chargesum: -0.0000000
charge: -0.095585 -0.372553 -0.342526 -0.552569 -0.326060 -0.125179 -0.087509 -0.095820 -0.018912 0.338067 0.175735 0.123162 -0.189753 -0.282531 0.185764 0.212761 -0.132510 -0.299612 -0.235445 -0.116837 -0.166591 0.099312 0.028079 0.022731 -0.137202 -0.420132 -0.424865 0.023225 0.025265 0.087133 0.102195 0.113353 0.119172 0.120795 0.187473 0.123235 0.139835 0.138248 0.140476 0.143600 0.151945 0.147290 0.126437 0.130389 0.145591 0.136437 0.104499 0.127757 0.129082 0.285267 0.287882
qa: -0.0956 -0.3726 -0.3425 -0.5526 -0.3261 -0.1252 -0.0875 -0.0958 -0.0189 0.3381 0.1757 0.1232 -0.1898 -0.2825 0.1858 0.2128 -0.1325 -0.2996 -0.2354 -0.1168 -0.1666 0.0993 0.0281 0.0227 -0.1372 -0.4201 -0.4249 0.0232 0.0253 0.0871 0.1022 0.1134 0.1192 0.1208 0.1875 0.1232 0.1398 0.1382 0.1405 0.1436 0.1519 0.1473 0.1264 0.1304 0.1456 0.1364 0.1045 0.1278 0.1291 0.2853 0.2879
va: 1.2143 1.9647 2.0320 1.9499 2.0327 3.1214 3.7735 3.8614 3.6914 3.6586 4.2013 3.4846 3.8036 4.0127 3.9226 3.8487 3.8372 4.0402 3.9851 3.8607 3.9035 3.7710 3.9929 3.9253 3.8638 3.6671 3.6449 3.6419 3.6462 1.0284 1.0094 1.0070 0.9965 1.0156 1.0086 1.0280 1.0024 1.0042 1.0217 1.0087 0.9993 1.0030 0.9840 0.9865 0.9853 0.9876 0.9837 0.9930 0.9904 0.9474 0.9452
dispcorr: -0.035311534 hartree
energy: -1705.552383678370
dipole: -14.71074 13.58875 -1.12199 14.04342 -13.78970 0.25372 -4.83063 2.90712 -1.92351
magnitude: 2.24123 au
magnitude: 5.69675 debye
