program: Orca
programVersion: 5.0.2
elementType: Cl O O O O N C C C C C C C C C C C C C C C C C C C C C C C H H H H H H H H H H H H H H H H H H H H H H
charge: 0
multiplicity: 1
keywords: wb97x-d3
keywords: def2-TZVPP
keywords: def2/J RIJCOSX
keywords: DEFGRID2
keywords: scfconv7
keywords: smallprint printgap noloewdin
keywords: NOSOSCF
formula: C23H22ClNO4
InChI: InChI=1/C23H22ClNO4/c1-4-14-28-20-11-6-17(16-21(20)27-3)12-13-25-23(26)22(29-15-5-2)18-7-9-19(24)10-8-18/h1-2,6-11,16,22,25H,12-15H2,3H3
51 atoms
Cl 2.686482 -2.788973 0.82124
O  -3.329233 -0.602429 -1.229638
O  1.790404 0.987004 2.099364
O  -2.716158 1.120673 1.766278
O  3.4710 0.576535 0.209631
N  -2.739713 1.831469 -0.38869
C  -1.158154 3.665476 -0.858262
C  -2.431111 3.224504 -0.144098
C  0.061169 2.821013 -0.593264
C  -2.853185 -0.552181 0.091032
C  -2.776583 0.897868 0.559647
C  -1.467244 -1.140861 0.248238
C  0.340252 2.313002 0.679991
C  0.95134 2.550196 -1.617496
C  1.470255 1.548237 0.913301
C  2.38088 1.309779 -0.132177
C  2.112292 1.812706 -1.390257
C  -0.529541 -1.054331 -0.775356
C  -1.098208 -1.722937 1.454967
C  0.749225 -1.563631 -0.608376
C  0.18283 -2.218412 1.643733
C  1.095594 -2.1384 0.604414
C  -3.652206 -1.895756 -1.697138
C  4.521602 0.444652 -0.723675
C  0.886298 1.140507 3.176844
C  -4.802105 -2.469346 -1.000821
C  4.224401 -0.493961 -1.802984
C  -5.742958 -2.941667 -0.421206
C  4.000185 -1.25734 -2.702684
H  -0.968936 4.702056 -0.563832
H  -1.339198 3.689802 -1.935451
H  -2.351836 3.377955 0.929162
H  -3.258231 3.848488 -0.486301
H  -3.541562 -1.063988 0.77579
H  -2.771088 1.531406 -1.352324
H  -0.338086 2.522797 1.496007
H  0.755467 2.920424 -2.616201
H  2.783857 1.635971 -2.21943
H  -0.784806 -0.594433 -1.721684
H  -1.817397 -1.802382 2.260614
H  1.466269 -1.504917 -1.415851
H  0.4572 -2.670221 2.58719
H  -3.879299 -1.79261 -2.759174
H  -2.801757 -2.581509 -1.616644
H  4.80294 1.414769 -1.146736
H  5.379742 0.082146 -0.156488
H  -0.10409 0.743951 2.941234
H  1.299849 0.575513 4.008866
H  0.785259 2.186066 3.479074
H  -6.580931 -3.360955 0.089613
H  3.79643 -1.937308 -3.499348
elementType: Cl O N C H
totalener: -1705.51914660 hartree
nucrepener: 3042.52010673 hartree
electener: -4748.03925333 hartree
oneelecener: -8385.59119898 hartree
twoeener: 3637.55194565 hartree
cpcmener: -0.05446483 hartree
kineticenergy: 1699.42996072 hartree
xcener: -141.303094619724 hartree
chargesum: -0.0000000
charge: -0.094565 -0.380168 -0.347704 -0.564517 -0.322953 -0.160314 -0.082442 -0.035428 -0.011957 0.276182 0.266290 0.197796 -0.237212 -0.270329 0.233711 0.194777 -0.129710 -0.374597 -0.290159 -0.043462 -0.133459 0.049261 0.017874 0.019752 -0.132429 -0.441165 -0.414764 0.044582 0.013038 0.087737 0.092445 0.101589 0.111459 0.125782 0.175705 0.117798 0.137262 0.138889 0.141671 0.142968 0.157762 0.143538 0.131653 0.136834 0.147284 0.137374 0.094891 0.129694 0.128121 0.286099 0.287514
qa: -0.0946 -0.3802 -0.3477 -0.5645 -0.3230 -0.1603 -0.0824 -0.0354 -0.0120 0.2762 0.2663 0.1978 -0.2372 -0.2703 0.2337 0.1948 -0.1297 -0.3746 -0.2902 -0.0435 -0.1335 0.0493 0.0179 0.0198 -0.1324 -0.4412 -0.4148 0.0446 0.0130 0.0877 0.0924 0.1016 0.1115 0.1258 0.1757 0.1178 0.1373 0.1389 0.1417 0.1430 0.1578 0.1435 0.1317 0.1368 0.1473 0.1374 0.0949 0.1297 0.1281 0.2861 0.2875
va: 1.2142 1.9471 2.0262 1.9397 2.0354 3.2482 3.8352 3.8456 3.7054 3.6738 4.2787 3.2583 3.8244 3.9874 3.8719 3.8640 3.8358 4.0389 4.0324 3.7739 3.9155 3.8129 3.9913 3.9258 3.8580 3.7555 3.6213 3.6130 3.6494 1.0072 1.0064 1.0210 1.0029 1.0144 1.0227 1.0343 1.0030 1.0038 1.0267 1.0122 0.9863 1.0055 0.9840 0.9828 0.9874 0.9876 0.9921 0.9933 0.9890 0.9457 0.9459
dispcorr: -0.035317301 hartree
energy: -1705.554463901720
dipole: -11.74648 10.98457 -0.76191 14.99482 -14.42161 0.57320 -4.04097 1.84174 -2.19923
magnitude: 2.39701 au
magnitude: 6.09272 debye
