program: Orca
programVersion: 5.0.2
elementType: Cl O O O O N C C C C C C C C C C C C C C C C C C C C C C C H H H H H H H H H H H H H H H H H H H H H H
charge: 0
multiplicity: 1
keywords: wb97x-d3
keywords: def2-TZVPP
keywords: def2/J RIJCOSX
keywords: DEFGRID2
keywords: scfconv7
keywords: smallprint printgap noloewdin
keywords: NOSOSCF
formula: C23H22ClNO4
InChI: InChI=1/C23H22ClNO4/c1-4-14-28-20-11-6-17(16-21(20)27-3)12-13-25-23(26)22(29-15-5-2)18-7-9-19(24)10-8-18/h1-2,6-11,16,22,25H,12-15H2,3H3
51 atoms
Cl 2.205823 -3.468119 0.001101
O  -3.635645 -0.204797 -0.100074
O  1.652051 0.122889 -2.499366
O  -1.672181 1.566115 2.237991
O  3.051537 -0.027663 -0.361042
N  -2.617382 2.197314 0.275951
C  -1.057912 3.84302 -0.721911
C  -2.174158 3.57317 0.289807
C  0.082576 2.868763 -0.606308
C  -2.722791 -0.141048 0.964611
C  -2.291671 1.307505 1.215092
C  -1.483808 -0.975067 0.709705
C  0.332667 1.964828 -1.640848
C  0.871762 2.807834 0.529344
C  1.3425 1.020945 -1.544303
C  2.11582 0.951917 -0.372578
C  1.87673 1.851392 0.651349
C  -0.686293 -1.377673 1.775658
C  -1.113549 -1.336745 -0.580103
C  0.457225 -2.132182 1.564826
C  0.0195 -2.104256 -0.805495
C  0.796986 -2.494701 0.27154
C  -4.694606 -1.119491 0.063786
C  3.793457 -0.249393 0.815359
C  0.878515 0.10827 -3.679739
C  -4.27147 -2.51774 0.009402
C  4.826912 0.761495 1.030603
C  -3.930177 -3.668675 -0.035189
C  5.691022 1.57788 1.205557
H  -0.712521 4.869011 -0.56794
H  -1.469515 3.805427 -1.73318
H  -1.840575 3.814922 1.296976
H  -3.024974 4.221619 0.07326
H  -3.191668 -0.477233 1.89873
H  -3.124276 1.872706 -0.533194
H  -0.284323 2.011388 -2.529478
H  0.70991 3.499263 1.347124
H  2.461768 1.831828 1.561125
H  -0.960699 -1.118737 2.790211
H  -1.713866 -1.040767 -1.429637
H  1.064084 -2.444583 2.404072
H  0.284082 -2.396748 -1.812497
H  -5.225837 -0.939788 1.006139
H  -5.401259 -0.923054 -0.74461
H  3.145209 -0.317248 1.696023
H  4.265802 -1.224739 0.69177
H  1.267653 -0.701251 -4.294118
H  -0.179723 -0.083262 -3.480444
H  0.966794 1.043595 -4.240151
H  -3.610398 -4.686268 -0.072679
H  6.459103 2.304224 1.353466
elementType: Cl O N C H
totalener: -1705.52575430 hartree
nucrepener: 3034.87298365 hartree
electener: -4740.39873795 hartree
oneelecener: -8370.36576895 hartree
twoeener: 3629.96703100 hartree
cpcmener: -0.05073399 hartree
kineticenergy: 1699.44093191 hartree
xcener: -141.300592587178 hartree
chargesum: -0.0000000
charge: -0.105747 -0.388522 -0.328174 -0.522877 -0.310096 -0.166812 -0.097166 -0.047921 0.048780 0.324638 0.237018 0.112576 -0.236172 -0.303140 0.222586 0.194547 -0.126942 -0.250349 -0.260276 -0.158389 -0.128239 0.114569 0.007727 -0.011094 -0.144961 -0.413927 -0.455817 0.035980 0.092024 0.095085 0.086091 0.100452 0.107141 0.122551 0.173824 0.120927 0.134291 0.133601 0.132738 0.140644 0.140968 0.138880 0.130136 0.123583 0.142775 0.123424 0.128287 0.104044 0.122911 0.281383 0.282444
qa: -0.1057 -0.3885 -0.3282 -0.5229 -0.3101 -0.1668 -0.0972 -0.0479 0.0488 0.3246 0.2370 0.1126 -0.2362 -0.3031 0.2226 0.1945 -0.1269 -0.2503 -0.2603 -0.1584 -0.1282 0.1146 0.0077 -0.0111 -0.1450 -0.4139 -0.4558 0.0360 0.0920 0.0951 0.0861 0.1005 0.1071 0.1226 0.1738 0.1209 0.1343 0.1336 0.1327 0.1406 0.1410 0.1389 0.1301 0.1236 0.1428 0.1234 0.1283 0.1040 0.1229 0.2814 0.2824
va: 1.1990 1.9255 2.0466 1.9884 2.0517 3.2088 3.8263 3.8448 3.6273 3.6189 4.3481 3.3820 3.8945 3.9924 3.8875 3.8694 3.8309 4.0681 3.9277 3.9510 3.9167 3.7879 4.0019 3.9972 3.8734 3.6745 3.9017 3.6180 3.5602 1.0112 1.0109 1.0238 1.0062 1.0040 1.0267 1.0199 1.0062 1.0069 1.0250 1.0320 1.0057 1.0082 0.9847 0.9865 0.9798 0.9950 0.9922 0.9842 0.9900 0.9492 0.9482
dispcorr: -0.034358975 hartree
energy: -1705.560113273965
dipole: -12.73593 10.33619 -2.39974 16.88344 -16.30053 0.58292 -5.01577 3.85908 -1.15670
magnitude: 2.72699 au
magnitude: 6.93147 debye
