program: Orca
programVersion: 5.0.2
elementType: Cl O O O O N C C C C C C C C C C C C C C C C C C C C C C C H H H H H H H H H H H H H H H H H H H H H H
charge: 0
multiplicity: 1
keywords: wb97x-d3
keywords: def2-TZVPP
keywords: def2/J RIJCOSX
keywords: DEFGRID2
keywords: scfconv7
keywords: smallprint printgap noloewdin
keywords: NOSOSCF
formula: C23H22ClNO4
InChI: InChI=1/C23H22ClNO4/c1-4-14-28-20-11-6-17(16-21(20)27-3)12-13-25-23(26)22(29-15-5-2)18-7-9-19(24)10-8-18/h1-2,6-11,16,22,25H,12-15H2,3H3
51 atoms
Cl 2.803802 -2.859994 -1.368796
O  -3.487152 -0.878468 -0.624125
O  2.434799 0.606115 -1.899202
O  -1.972461 0.930519 2.008418
O  3.458601 0.665973 0.45016
N  -2.652105 1.634769 -0.039757
C  -1.260525 3.608701 -0.594412
C  -2.464694 3.052892 0.16607
C  0.015591 2.873851 -0.290384
C  -2.550688 -0.752659 0.412427
C  -2.373844 0.702029 0.875311
C  -1.214886 -1.286681 -0.056002
C  0.621791 2.085203 -1.270684
C  0.596203 2.931538 0.964763
C  1.778261 1.368266 -1.005266
C  2.340804 1.415935 0.282748
C  1.748455 2.20482 1.253186
C  -0.981542 -1.605385 -1.389163
C  -0.184974 -1.461871 0.865266
C  0.251507 -2.095917 -1.796209
C  1.05211 -1.942346 0.469143
C  1.26175 -2.254372 -0.864582
C  -4.835959 -0.834679 -0.209792
C  4.103658 0.675197 1.703582
C  1.960282 0.568074 -3.227011
C  -5.246782 -2.063784 0.46623
C  3.359203 -0.052198 2.729903
C  -5.588134 -3.076133 1.016147
C  2.75266 -0.662706 3.568078
H  -1.167975 4.666799 -0.335046
H  -1.461752 3.570955 -1.667657
H  -2.355815 3.233402 1.233703
H  -3.366882 3.577496 -0.154277
H  -2.861926 -1.322112 1.298198
H  -2.943359 1.329748 -0.957114
H  0.174066 2.047226 -2.255912
H  0.155722 3.541524 1.744233
H  2.163004 2.272013 2.250143
H  -1.756767 -1.48805 -2.133411
H  -0.341352 -1.231227 1.911521
H  0.415229 -2.348504 -2.835471
H  1.83919 -2.07545 1.198543
H  -5.040805 0.024618 0.440248
H  -5.43476 -0.69787 -1.112871
H  5.067544 0.188544 1.543868
H  4.314887 1.695699 2.042753
H  0.936969 0.189895 -3.294478
H  2.002876 1.552227 -3.703692
H  2.615159 -0.109827 -3.770776
H  -5.886701 -3.979763 1.499485
H  2.215588 -1.202729 4.315784
elementType: Cl O N C H
totalener: -1705.52740169 hartree
nucrepener: 3027.46832041 hartree
electener: -4732.99572210 hartree
oneelecener: -8355.64249455 hartree
twoeener: 3622.64677245 hartree
cpcmener: -0.05081687 hartree
kineticenergy: 1699.41846797 hartree
xcener: -141.295180023658 hartree
chargesum: 0.0000000
charge: -0.099607 -0.362136 -0.317254 -0.512124 -0.312337 -0.169712 -0.093325 -0.055886 0.067545 0.255539 0.241702 0.104313 -0.259001 -0.334867 0.205681 0.209777 -0.105096 -0.211492 -0.244948 -0.198394 -0.154578 0.133413 0.016421 0.022920 -0.146666 -0.443776 -0.415614 0.061077 0.017685 0.095469 0.087915 0.100918 0.107115 0.121057 0.176238 0.121241 0.135922 0.134565 0.140934 0.133792 0.147027 0.147217 0.129664 0.126026 0.132568 0.142659 0.103056 0.128996 0.123474 0.282751 0.282135
qa: -0.0996 -0.3621 -0.3173 -0.5121 -0.3123 -0.1697 -0.0933 -0.0559 0.0675 0.2555 0.2417 0.1043 -0.2590 -0.3349 0.2057 0.2098 -0.1051 -0.2115 -0.2449 -0.1984 -0.1546 0.1334 0.0164 0.0229 -0.1467 -0.4438 -0.4156 0.0611 0.0177 0.0955 0.0879 0.1009 0.1071 0.1211 0.1762 0.1212 0.1359 0.1346 0.1409 0.1338 0.1470 0.1472 0.1297 0.1260 0.1326 0.1427 0.1031 0.1290 0.1235 0.2828 0.2821
va: 1.2084 1.9599 2.0544 2.0014 2.0557 3.1928 3.8222 3.8504 3.6144 3.7129 4.1886 3.5156 3.9166 4.0088 3.8938 3.8519 3.8014 3.9549 4.0217 3.9326 3.9091 3.8026 3.9586 3.9353 3.8712 3.7728 3.6499 3.5996 3.6670 1.0110 1.0109 1.0239 1.0061 1.0126 1.0214 1.0203 1.0054 1.0053 1.0254 1.0350 1.0020 1.0056 0.9880 0.9855 0.9876 0.9838 0.9813 0.9918 0.9964 0.9476 0.9496
dispcorr: -0.034309193 hartree
energy: -1705.561710886147
dipole: -13.82771 11.98070 -1.84701 16.61045 -15.39769 1.21276 -0.54825 -0.74554 -1.29378
magnitude: 2.56049 au
magnitude: 6.50825 debye
