program: Orca
programVersion: 5.0.2
elementType: Cl O O O O N C C C C C C C C C C C C C C C C C C C C C C C H H H H H H H H H H H H H H H H H H H H H H
charge: 0
multiplicity: 1
keywords: wb97x-d3
keywords: def2-TZVPP
keywords: def2/J RIJCOSX
keywords: DEFGRID2
keywords: scfconv7
keywords: smallprint printgap noloewdin
keywords: NOSOSCF
formula: C23H22ClNO4
InChI: InChI=1/C23H22ClNO4/c1-4-14-28-20-11-6-17(16-21(20)27-3)12-13-25-23(26)22(29-15-5-2)18-7-9-19(24)10-8-18/h1-2,6-11,16,22,25H,12-15H2,3H3
51 atoms
Cl 2.553758 -3.223523 -1.117337
O  -3.730708 -1.102348 -0.88073
O  1.811031 1.619644 2.514142
O  -2.438775 1.025365 1.587497
O  3.368087 0.2470 0.997756
N  -2.620419 1.413464 -0.643719
C  -0.944521 3.101111 -1.313054
C  -2.287628 2.820155 -0.642491
C  0.212102 2.335397 -0.727684
C  -2.832068 -0.862628 0.168389
C  -2.622451 0.635467 0.442665
C  -1.492058 -1.467158 -0.181168
C  0.466728 2.369597 0.646477
C  1.053991 1.591578 -1.535154
C  1.521783 1.66373 1.198935
C  2.375584 0.921455 0.362483
C  2.138454 0.899497 -0.998043
C  -1.171312 -1.846408 -1.479539
C  -0.538503 -1.624584 0.821308
C  0.073593 -2.38612 -1.771101
C  0.709656 -2.155916 0.542712
C  1.002093 -2.538012 -0.756599
C  -5.082937 -0.838677 -0.57311
C  4.481319 -0.189528 0.247266
C  0.908777 2.226762 3.416176
C  -5.634554 -1.787994 0.391569
C  5.271984 0.921497 -0.274935
C  -6.079004 -2.565623 1.192018
C  5.931912 1.836885 -0.686127
H  -0.763126 4.178259 -1.244982
H  -1.020335 2.874135 -2.379379
H  -2.292123 3.172177 0.386896
H  -3.069354 3.373241 -1.166762
H  -3.187724 -1.306471 1.107007
H  -2.751239 0.972755 -1.542832
H  -0.176897 2.95956 1.285971
H  0.880156 1.544461 -2.603183
H  2.773993 0.332986 -1.665888
H  -1.884766 -1.73868 -2.284835
H  -0.76783 -1.336485 1.839818
H  0.307693 -2.685262 -2.78403
H  1.438626 -2.272984 1.3330
H  -5.22987 0.181675 -0.199137
H  -5.632879 -0.911656 -1.513109
H  5.08877 -0.776708 0.937563
H  4.1945 -0.861914 -0.566702
H  1.278101 2.007716 4.416052
H  0.868423 3.312563 3.292177
H  -0.101939 1.820529 3.318504
H  -6.486544 -3.254128 1.898417
H  6.506592 2.65757 -1.054218
elementType: Cl O N C H
totalener: -1705.52658690 hartree
nucrepener: 2975.69079348 hartree
electener: -4681.21738038 hartree
oneelecener: -8251.29120905 hartree
twoeener: 3570.07382867 hartree
cpcmener: -0.04695602 hartree
kineticenergy: 1699.41917545 hartree
xcener: -141.292974045499 hartree
chargesum: 0.0000000
charge: -0.103367 -0.350237 -0.330166 -0.510208 -0.324040 -0.160741 -0.089523 -0.050101 0.042586 0.246778 0.243514 0.102326 -0.287499 -0.314552 0.271899 0.155228 -0.088991 -0.207946 -0.274905 -0.157378 -0.114276 0.100932 0.022066 0.026523 -0.125280 -0.429826 -0.427401 0.042389 0.040469 0.092044 0.087667 0.101005 0.109290 0.121012 0.175515 0.124505 0.131756 0.134486 0.141683 0.137507 0.141642 0.139744 0.127744 0.125951 0.133610 0.125087 0.123011 0.110002 0.103598 0.282079 0.282789
qa: -0.1034 -0.3502 -0.3302 -0.5102 -0.3240 -0.1607 -0.0895 -0.0501 0.0426 0.2468 0.2435 0.1023 -0.2875 -0.3146 0.2719 0.1552 -0.0890 -0.2079 -0.2749 -0.1574 -0.1143 0.1009 0.0221 0.0265 -0.1253 -0.4298 -0.4274 0.0424 0.0405 0.0920 0.0877 0.1010 0.1093 0.1210 0.1755 0.1245 0.1318 0.1345 0.1417 0.1375 0.1416 0.1397 0.1277 0.1260 0.1336 0.1251 0.1230 0.1100 0.1036 0.2821 0.2828
va: 1.2037 1.9798 2.0575 2.0018 2.0240 3.1941 3.8284 3.8459 3.6412 3.7193 4.1434 3.4775 3.8710 3.9867 3.8740 3.8172 3.7426 4.0004 4.0347 3.9956 3.8908 3.7810 3.9679 3.9169 3.8713 3.7461 3.7653 3.6287 3.6482 1.0091 1.0090 1.0231 1.0045 1.0186 1.0177 1.0190 1.0068 1.0039 1.0239 1.0234 1.0069 1.0107 0.9908 0.9845 0.9877 0.9999 0.9943 0.9862 0.9963 0.9485 0.9481
dispcorr: -0.032767011 hartree
energy: -1705.559353908637
dipole: -12.74275 11.16451 -1.57824 18.41636 -17.56145 0.85491 2.24560 -3.86601 -1.62041
magnitude: 2.41815 au
magnitude: 6.14645 debye
