program: Orca
programVersion: 5.0.2
elementType: Cl O O O O N C C C C C C C C C C C C C C C C C C C C C C C H H H H H H H H H H H H H H H H H H H H H H
charge: 0
multiplicity: 1
keywords: wb97x-d3
keywords: def2-TZVPP
keywords: def2/J RIJCOSX
keywords: DEFGRID2
keywords: scfconv7
keywords: smallprint printgap noloewdin
keywords: NOSOSCF
formula: C23H22ClNO4
InChI: InChI=1/C23H22ClNO4/c1-4-14-28-20-11-6-17(16-21(20)27-3)12-13-25-23(26)22(29-15-5-2)18-7-9-19(24)10-8-18/h1-2,6-11,16,22,25H,12-15H2,3H3
51 atoms
Cl 2.655706 -2.841511 1.074508
O  -3.233366 -0.591772 -1.266228
O  1.872111 1.018416 2.007098
O  -2.677689 1.06404 1.78422
O  3.483335 0.626207 0.056318
N  -2.716566 1.812706 -0.357288
C  -1.195643 3.699332 -0.815928
C  -2.44473 3.207063 -0.089602
C  0.041102 2.865037 -0.604499
C  -2.830938 -0.578016 0.078097
C  -2.750969 0.863831 0.578127
C  -1.466068 -1.194645 0.296116
C  0.368075 2.347836 0.653805
C  0.893862 2.605313 -1.662185
C  1.508884 1.58649 0.841966
C  2.381299 1.357477 -0.239071
C  2.063788 1.867803 -1.482542
C  -0.472369 -1.091512 -0.671173
C  -1.167743 -1.808272 1.506911
C  0.795222 -1.604229 -0.442256
C  0.100959 -2.30713 1.758408
C  1.073503 -2.200758 0.776987
C  -3.572016 -1.86143 -1.778138
C  4.494671 0.496163 -0.916674
C  1.004143 1.140827 3.114951
C  -4.798905 -2.394387 -1.18896
C  4.161208 -0.458549 -1.971747
C  -5.808787 -2.828778 -0.704501
C  3.900128 -1.251705 -2.835418
H  -1.017521 4.729115 -0.490704
H  -1.400326 3.757278 -1.887973
H  -2.348921 3.337633 0.985861
H  -3.296703 3.814872 -0.402066
H  -3.566062 -1.088057 0.714637
H  -2.792538 1.531753 -1.323606
H  -0.285206 2.543207 1.493915
H  0.661506 2.981508 -2.651121
H  2.702655 1.695816 -2.338514
H  -0.673038 -0.612015 -1.621007
H  -1.931211 -1.902798 2.269259
H  1.556108 -1.531237 -1.207647
H  0.321684 -2.778902 2.706491
H  -3.706743 -1.73562 -2.854026
H  -2.761018 -2.585755 -1.640825
H  4.754317 1.464341 -1.358875
H  5.378108 0.142946 -0.382346
H  0.911791 2.177724 3.450631
H  0.005931 0.748847 2.903523
H  1.445661 0.55421 3.918034
H  -6.706841 -3.219917 -0.281001
H  3.67529 -1.960083 -3.601299
elementType: Cl O N C H
totalener: -1705.52798552 hartree
nucrepener: 3030.05846869 hartree
electener: -4735.58645421 hartree
oneelecener: -8360.35402315 hartree
twoeener: 3624.76756894 hartree
cpcmener: -0.04478451 hartree
kineticenergy: 1699.43030814 hartree
xcener: -141.300157036115 hartree
chargesum: 0.0000000
charge: -0.092964 -0.372291 -0.327975 -0.528208 -0.306758 -0.163006 -0.088881 -0.038170 -0.005947 0.275842 0.248959 0.199121 -0.240115 -0.268516 0.238437 0.176330 -0.122577 -0.378074 -0.288204 -0.021183 -0.117259 0.028900 0.008693 0.010927 -0.133439 -0.440077 -0.418937 0.055924 0.028788 0.087488 0.089494 0.101149 0.109464 0.123606 0.170827 0.116070 0.133125 0.135554 0.137324 0.137702 0.146348 0.140430 0.127781 0.134822 0.144264 0.134150 0.125886 0.093465 0.126640 0.281658 0.283413
qa: -0.0930 -0.3723 -0.3280 -0.5282 -0.3068 -0.1630 -0.0889 -0.0382 -0.0059 0.2758 0.2490 0.1991 -0.2401 -0.2685 0.2384 0.1763 -0.1226 -0.3781 -0.2882 -0.0212 -0.1173 0.0289 0.0087 0.0109 -0.1334 -0.4401 -0.4189 0.0559 0.0288 0.0875 0.0895 0.1011 0.1095 0.1236 0.1708 0.1161 0.1331 0.1356 0.1373 0.1377 0.1463 0.1404 0.1278 0.1348 0.1443 0.1341 0.1259 0.0935 0.1266 0.2817 0.2834
va: 1.2164 1.9495 2.0510 1.9904 2.0536 3.2282 3.8409 3.8412 3.7037 3.6845 4.3103 3.2734 3.8355 3.9955 3.8754 3.8886 3.8413 4.0434 4.0457 3.7657 3.9042 3.8336 3.9976 3.9395 3.8658 3.7705 3.6429 3.6125 3.6433 1.0075 1.0066 1.0222 1.0028 1.0115 1.0283 1.0320 1.0043 1.0051 1.0285 1.0140 0.9929 1.0060 0.9845 0.9825 0.9857 0.9877 0.9894 0.9923 0.9934 0.9486 0.9482
dispcorr: -0.034697713 hartree
energy: -1705.562683234901
dipole: -11.78817 10.97084 -0.81733 15.16475 -14.63265 0.53210 -4.83534 2.82012 -2.01522
magnitude: 2.23881 au
magnitude: 5.69060 debye
