program: Orca
programVersion: 5.0.2
elementType: Cl O O O O N C C C C C C C C C C C C C C C C C C C C C C C H H H H H H H H H H H H H H H H H H H H H H
charge: 0
multiplicity: 1
keywords: wb97x-d3
keywords: def2-TZVPP
keywords: def2/J RIJCOSX
keywords: DEFGRID2
keywords: scfconv7
keywords: smallprint printgap noloewdin
keywords: NOSOSCF
formula: C23H22ClNO4
InChI: InChI=1/C23H22ClNO4/c1-4-14-28-20-11-6-17(16-21(20)27-3)12-13-25-23(26)22(29-15-5-2)18-7-9-19(24)10-8-18/h1-2,6-11,16,22,25H,12-15H2,3H3
51 atoms
Cl 2.200646 -2.687079 2.558604
O  -2.878294 -1.085783 -1.395778
O  2.710215 0.64486 1.571541
O  -3.242545 1.290095 1.221358
O  3.478379 0.112769 -0.81506
N  -2.499713 1.546019 -0.900807
C  -1.070944 3.385431 -0.010998
C  -2.286653 2.976514 -0.846521
C  0.151364 2.547918 -0.276243
C  -2.848455 -0.701867 -0.046461
C  -2.895129 0.821055 0.146083
C  -1.571299 -1.207801 0.581519
C  0.854798 1.993938 0.795739
C  0.595375 2.286782 -1.561649
C  1.977475 1.206917 0.59362
C  2.40154 0.932136 -0.718521
C  1.709678 1.480249 -1.783403
C  -0.436358 -1.472814 -0.176994
C  -1.515215 -1.381237 1.96057
C  0.728031 -1.92619 0.426757
C  -0.356181 -1.824305 2.576668
C  0.757053 -2.102747 1.799408
C  -4.153658 -1.039164 -1.99964
C  3.888535 -0.325992 -2.090194
C  2.363951 0.917033 2.912541
C  -5.023134 -2.121262 -1.542891
C  4.593678 0.70612 -2.846655
C  -5.747259 -3.00738 -1.1777
C  5.182832 1.548917 -3.467174
H  -1.319849 3.331016 1.049568
H  -0.867344 4.43982 -0.2201
H  -3.178312 3.46905 -0.45595
H  -2.171744 3.313825 -1.875378
H  -3.700667 -1.118029 0.506429
H  -2.146913 1.054377 -1.707144
H  0.501553 2.187122 1.80097
H  0.080656 2.703801 -2.418932
H  2.017792 1.296229 -2.804058
H  -0.438118 -1.337687 -1.250065
H  -2.387887 -1.181284 2.569304
H  1.601082 -2.139098 -0.175126
H  -0.330317 -1.960236 3.649439
H  -4.654463 -0.078116 -1.834551
H  -3.991517 -1.129118 -3.075341
H  4.561864 -1.166183 -1.91315
H  3.046052 -0.710895 -2.67559
H  2.419387 1.986114 3.137954
H  1.363663 0.555335 3.165762
H  3.089648 0.395655 3.532454
H  -6.37636 -3.806361 -0.854169
H  5.711998 2.289168 -4.024698
elementType: Cl O N C H
totalener: -1705.52643761 hartree
nucrepener: 2980.24332435 hartree
electener: -4685.76976196 hartree
oneelecener: -8259.81489787 hartree
twoeener: 3574.04513592 hartree
cpcmener: -0.04843777 hartree
kineticenergy: 1699.43226892 hartree
xcener: -141.296085461700 hartree
chargesum: 0.0000000
charge: -0.101092 -0.359732 -0.321203 -0.517617 -0.317401 -0.174761 -0.074555 -0.083929 -0.001779 0.263149 0.233167 0.130559 -0.206788 -0.318008 0.220736 0.194764 -0.129406 -0.270703 -0.214591 -0.109678 -0.169910 0.095490 0.014458 0.003501 -0.154549 -0.447289 -0.430878 0.065625 0.057405 0.086478 0.097382 0.108601 0.114968 0.123639 0.186552 0.122888 0.140010 0.135010 0.135958 0.136678 0.138533 0.143189 0.127724 0.125899 0.133020 0.140935 0.131555 0.105440 0.125738 0.282442 0.282373
qa: -0.1011 -0.3597 -0.3212 -0.5176 -0.3174 -0.1748 -0.0746 -0.0839 -0.0018 0.2631 0.2332 0.1306 -0.2068 -0.3180 0.2207 0.1948 -0.1294 -0.2707 -0.2146 -0.1097 -0.1699 0.0955 0.0145 0.0035 -0.1545 -0.4473 -0.4309 0.0656 0.0574 0.0865 0.0974 0.1086 0.1150 0.1236 0.1866 0.1229 0.1400 0.1350 0.1360 0.1367 0.1385 0.1432 0.1277 0.1259 0.1330 0.1409 0.1316 0.1054 0.1257 0.2824 0.2824
va: 1.2023 1.9679 2.0420 2.0054 2.0540 3.1816 3.7602 3.8899 3.7310 3.7226 4.2061 3.4558 3.8398 3.9965 3.8806 3.8817 3.8365 4.0189 4.0566 3.8642 3.9550 3.7706 3.9773 3.9540 3.8664 3.7835 3.7385 3.5921 3.6131 1.0286 1.0094 1.0123 0.9960 1.0119 1.0153 1.0170 1.0006 1.0061 1.0280 1.0226 1.0121 1.0057 0.9908 0.9851 0.9874 0.9832 0.9936 0.9799 0.9966 0.9478 0.9482
dispcorr: -0.033061290 hartree
energy: -1705.559498896484
dipole: -9.90144 9.07265 -0.82879 15.32239 -14.78545 0.53694 -8.95798 6.92522 -2.03277
magnitude: 2.25994 au
magnitude: 5.74431 debye
