program: Gaussian 09
title: 000064685
version: EM64L-G09RevD.01
frameworkgroup: C1[X(C10H18O)]
method: RPBEPBE
basis: SDD
operation: Freq
keyword: #pfreq=noraman
keyword: PBEPBE/SDD
title: #p freq=noraman PBEPBE/SDD
converged: NO YES NO NO
title: Mulliken charges:
elementType: O C C C C C C C C C C H H H H H H H H H H H H H H H H H H
charge: -0.458775 0.309552 0.342190 -0.202233 -0.191647 -0.517099 -0.523122 -0.486132 -0.819383 -0.787340 -0.786066 0.238433 0.231035 0.222488 0.229333 0.231588 0.236302 0.208153 0.228155 0.229509 0.202638 0.213511 0.213933 0.211432 0.233612 0.213163 0.238341 0.209719 0.328712
chargesum: 0.00000
title: Mulliken charges with hydrogens summed into heavy atoms:
elementType: O C C C C C C C C C C
charge: -0.130064 0.309552 0.342190 0.036200 0.039388 -0.065279 -0.055232 -0.049824 -0.173725 -0.128363 -0.124844
polarizability: 1.06986945e+02 -4.50564787e-01 1.04167971e+02 1.85631549e+00 -3.93845456e-01 9.93970783e+01
1716.lowfreq: -24.2361 -12.4853 0.0006 0.0006 0.0007 19.5000 106.1823 168.0194 199.8364
frequency: 106.0871 167.9748 199.8356 202.6118 217.4902 221.8025 242.6816 290.2113 307.7711 312.9738 343.1354 374.7598 419.6242 437.2102 482.3330 507.4846 566.1899 580.0841 635.7141 728.1409 759.3587 823.2698 828.5094 882.4725 914.7156 926.6985 937.9074 941.7398 951.7920 979.7878 985.1170 997.3140 1034.0986 1050.5238 1077.6539 1100.8195 1138.2500 1148.6844 1157.0261 1196.3210 1204.1615 1207.3621 1222.9704 1231.2484 1247.5264 1268.0196 1278.2908 1295.5736 1303.9831 1324.3700 1365.2857 1378.3385 1384.9545 1395.9604 1458.5388 1460.4477 1471.2220 1474.3038 1475.9370 1483.8079 1485.2098 1491.8583 1503.8772 2954.7717 2958.7431 2972.8108 2977.3767 3001.6512 3013.7484 3016.7724 3038.9612 3047.9737 3050.9930 3054.6873 3058.2974 3060.1159 3074.3352 3080.9955 3085.6351 3093.1142 3554.7440
redmass: 1.9619 1.2716 1.1078 1.2894 2.4994 2.0219 2.2597 1.8805 1.5698 1.9581 2.1648 2.6038 1.9596 2.6788 3.3548 2.9186 3.9838 3.3335 3.5110 2.5013 2.4806 1.8520 1.7513 2.2460 2.2703 1.7353 1.7547 1.4675 1.8629 2.3196 1.6274 1.9041 1.7180 2.0118 1.2495 1.4216 2.2635 2.1708 1.7384 1.9532 1.4815 1.5422 1.6830 1.9989 1.6116 1.7141 1.6084 1.5119 1.6588 1.9678 1.3637 1.2138 1.2509 1.1974 1.0626 1.0651 1.0542 1.0640 1.0577 1.0552 1.0728 1.0594 1.0744 1.0798 1.0419 1.0377 1.0377 1.0598 1.0632 1.0620 1.0974 1.0883 1.0991 1.1028 1.0973 1.0983 1.1036 1.1030 1.0977 1.0963 1.0658
irintensity: 0.4103 0.2516 0.1136 0.0071 1.2838 0.3247 0.1607 31.0492 120.3090 3.9225 1.8540 1.6913 2.0842 12.5605 0.3117 2.1894 0.3807 1.8646 1.6161 1.1487 2.4426 6.3456 2.4755 0.5765 1.7847 13.5378 5.4036 6.9712 6.3423 0.7949 31.3953 47.5157 1.5026 7.1115 1.7109 7.6528 2.8754 5.6695 1.3163 4.3513 14.2596 37.8075 4.9849 0.3759 0.3736 0.2006 5.9366 2.3106 8.3218 5.2385 4.7838 14.3105 14.9919 25.0949 0.7114 3.2009 11.7053 28.7169 0.0736 2.6239 8.9965 11.4541 6.8532 33.5072 54.0381 23.9000 57.8942 33.6603 46.7026 40.2317 36.1614 41.3369 3.6264 10.5368 75.8196 21.8448 10.6505 69.4852 45.2721 27.2323 3.0366
temp: 298.150 k
press: 1.00000 atm
elementType: 8 6 6 6 6 6 6 6 6 6 6 1 1 1 1 1 1 1 1 1 1 1 1 1 1 1 1 1 1
symmnumber: 1
zpe: 679988.2 jmol-1
zpe.correction: 0.258994 hartree
zpe.thermalcorrener: 0.270457 hartree
zpe.thermalcorrenthalpy: 0.271401 hartree
zpe.thermalcorrgfe: 0.223742 hartree
zpe.sumelectzpe: -466.181358 hartree
zpe.sumelectthermal: -466.169895 hartree
zpe.sumelectthermalent: -466.168950 hartree
zpe.sumelectthermalfe: -466.216610 hartree
dipole: 1.1469 1.3346 0.0941
dipole: 1.7623
quadrupole: -72.8823 -66.9946 -69.1158
quadrupole: -4.4393 0.8645 -0.2118
quadrupole: -3.2181 2.6697 0.5484 -4.4393 0.8645 -0.2118
hfenergy: -466.4403517 hartree
pointgroup: C01 [X(C10H18O1)]
dipole: 0.4657773 -0.5117787 -0.0428107 debye
polarizability: 106.9488233|0.5443609|104.2030769|-1.8610521|-0.4058184|99.4000937 unknown
InChI: InChI=1S/C10H18O/c1-9(2)7-4-5-10(9,3)8(11)6-7/h7-8,11H,4-6H2,1-3H3
charge 0 multiplicity 1
29 atoms
O  -2.637794 -0.340741 -0.208671
C  -0.160847 -0.714474 0.346276
C  1.119604 -0.019154 -0.289166
C  0.435574 1.398768 -0.320247
C  -1.251952 -0.328135 -0.714342
C  -0.430585 0.173792 1.604904
C  -0.877273 1.129641 -1.117144
C  0.025448 1.611165 1.166238
C  -0.080224 -2.216312 0.636541
C  1.529026 -0.547988 -1.688511
C  2.378802 -0.096825 0.6076
H  1.056406 2.209944 -0.738252
H  -1.186153 -1.025274 -1.575687
H  0.139523 -0.196457 2.476014
H  -1.502558 0.145113 1.866074
H  -1.689554 1.814092 -0.81742
H  -0.739258 1.23121 -2.207295
H  -0.788082 2.352196 1.258737
H  0.873197 1.975386 1.773734
H  0.735776 -2.445854 1.346444
H  -1.017633 -2.588229 1.096587
H  0.095495 -2.804343 -0.285032
H  2.410647 0.010428 -2.056281
H  1.81696 -1.615327 -1.634617
H  0.738619 -0.451871 -2.451167
H  3.163267 0.582852 0.222965
H  2.184638 0.176147 1.657498
H  2.798666 -1.120755 0.599728
H  -2.894835 -1.277496 -0.012906
