program: Orca
programVersion: 5.0.2
elementType: Cl O O O O N C C C C C C C C C C C C C C C C C C C C C C C H H H H H H H H H H H H H H H H H H H H H H
charge: 0
multiplicity: 1
keywords: wb97x-d3
keywords: def2-TZVPP
keywords: def2/J RIJCOSX
keywords: DEFGRID2
keywords: scfconv7
keywords: smallprint printgap noloewdin
keywords: NOSOSCF
formula: C23H22ClNO4
InChI: InChI=1/C23H22ClNO4/c1-4-14-28-20-11-6-17(16-21(20)27-3)12-13-25-23(26)22(29-15-5-2)18-7-9-19(24)10-8-18/h1-2,6-11,16,22,25H,12-15H2,3H3
51 atoms
Cl 2.536835 -3.518487 0.259435
O  -3.339211 -0.769451 -1.176914
O  2.288781 3.316232 -1.777035
O  -3.039264 0.165673 2.21249
O  3.473401 1.106559 -1.262426
N  -2.527832 1.351717 0.357636
C  -0.996802 2.643863 1.846517
C  -2.290368 2.611739 1.028475
C  0.20857 2.213324 1.059843
C  -2.943026 -1.034881 0.141487
C  -2.85218 0.232078 1.005281
C  -1.578068 -1.681435 0.129682
C  0.679912 3.005629 0.007112
C  0.859325 1.025576 1.336234
C  1.771368 2.615837 -0.749176
C  2.424353 1.401845 -0.455244
C  1.966279 0.622361 0.588555
C  -0.738703 -1.608027 -0.975845
C  -1.129089 -2.332531 1.274956
C  0.524142 -2.181948 -0.943889
C  0.133854 -2.899257 1.324211
C  0.95065 -2.81939 0.207764
C  -4.708709 -0.465004 -1.332038
C  4.185176 -0.090882 -1.04794
C  1.708458 4.562986 -2.097569
C  -5.562019 -1.636863 -1.143494
C  5.037811 -0.042971 0.137328
C  -6.257752 -2.60345 -0.987134
C  5.758773 0.008932 1.096538
H  -1.10329 2.010664 2.727721
H  -0.870671 3.66654 2.212748
H  -3.13602 2.84907 1.67657
H  -2.262254 3.379192 0.255819
H  -3.649877 -1.708383 0.64347
H  -2.334689 1.297504 -0.630031
H  0.176582 3.940704 -0.207749
H  0.518361 0.395262 2.14829
H  2.452117 -0.307512 0.850443
H  -1.051785 -1.107472 -1.881562
H  -1.769148 -2.405855 2.145236
H  1.165761 -2.122583 -1.812788
H  0.469164 -3.400048 2.222376
H  -5.033367 0.332944 -0.653922
H  -4.828568 -0.084192 -2.347894
H  3.518028 -0.957512 -0.993013
H  4.807288 -0.227903 -1.933732
H  0.665769 4.463727 -2.412275
H  1.761005 5.268033 -1.263118
H  2.283865 4.96675 -2.928229
H  -6.879983 -3.459384 -0.850747
H  6.394712 0.063253 1.952055
elementType: Cl O N C H
totalener: -1705.52701735 hartree
nucrepener: 2922.11058543 hartree
electener: -4627.63760278 hartree
oneelecener: -8143.10247196 hartree
twoeener: 3515.46486918 hartree
cpcmener: -0.04746800 hartree
kineticenergy: 1699.42867939 hartree
xcener: -141.293883906588 hartree
chargesum: -0.0000000
charge: -0.098567 -0.354449 -0.328096 -0.512664 -0.315532 -0.162762 -0.082363 -0.093198 -0.014778 0.262582 0.236876 0.089356 -0.225834 -0.299510 0.216477 0.266706 -0.181676 -0.196802 -0.234913 -0.157828 -0.142859 0.084268 0.021909 0.061917 -0.133106 -0.437360 -0.434124 0.050337 0.033885 0.089983 0.101705 0.111359 0.114609 0.122915 0.181331 0.124287 0.141302 0.128466 0.140453 0.136712 0.148831 0.142227 0.127497 0.125873 0.103489 0.132250 0.109437 0.111564 0.123546 0.282315 0.281959
qa: -0.0986 -0.3544 -0.3281 -0.5127 -0.3155 -0.1628 -0.0824 -0.0932 -0.0148 0.2626 0.2369 0.0894 -0.2258 -0.2995 0.2165 0.2667 -0.1817 -0.1968 -0.2349 -0.1578 -0.1429 0.0843 0.0219 0.0619 -0.1331 -0.4374 -0.4341 0.0503 0.0339 0.0900 0.1017 0.1114 0.1146 0.1229 0.1813 0.1243 0.1413 0.1285 0.1405 0.1367 0.1488 0.1422 0.1275 0.1259 0.1035 0.1323 0.1094 0.1116 0.1235 0.2823 0.2820
va: 1.2091 1.9753 2.0580 2.0078 2.0693 3.1712 3.7552 3.8824 3.7278 3.7233 4.1569 3.5045 3.8877 3.9820 3.9576 3.8371 3.8258 3.9650 4.0377 3.9132 3.9981 3.7923 3.9650 3.9293 3.8797 3.7536 3.7120 3.6147 3.6612 1.0305 1.0107 1.0132 0.9998 1.0161 1.0153 1.0188 1.0030 1.0067 1.0242 1.0269 0.9998 1.0053 0.9909 0.9850 1.0086 0.9932 0.9862 0.9870 0.9937 0.9481 0.9486
dispcorr: -0.031274710 hartree
energy: -1705.558292058039
dipole: -11.67598 10.53429 -1.14169 21.02665 -19.68241 1.34423 -1.31862 -0.01700 -1.33562
magnitude: 2.21231 au
magnitude: 5.62324 debye
