program: Orca
programVersion: 5.0.2
elementType: Cl O O O O N C C C C C C C C C C C C C C C C C C C C C C C H H H H H H H H H H H H H H H H H H H H H H
charge: 0
multiplicity: 1
keywords: wb97x-d3
keywords: def2-TZVPP
keywords: def2/J RIJCOSX
keywords: DEFGRID2
keywords: scfconv7
keywords: smallprint printgap noloewdin
keywords: NOSOSCF
formula: C23H22ClNO4
InChI: InChI=1/C23H22ClNO4/c1-4-14-28-20-11-6-17(16-21(20)27-3)12-13-25-23(26)22(29-15-5-2)18-7-9-19(24)10-8-18/h1-2,6-11,16,22,25H,12-15H2,3H3
51 atoms
Cl 2.647543 -3.009244 0.998876
O  -3.324789 -1.210752 -1.128364
O  2.071969 0.786437 2.061253
O  -2.932056 1.492638 1.086784
O  3.401394 0.151309 -0.034531
N  -2.499351 1.413041 -1.131889
C  -1.165228 3.455616 -0.530002
C  -2.305462 2.832371 -1.344099
C  0.060706 2.58907 -0.44716
C  -2.818812 -0.673868 0.068518
C  -2.764631 0.861017 0.052588
C  -1.429674 -1.221601 0.286878
C  0.481066 2.098692 0.791026
C  0.782644 2.238969 -1.575604
C  1.60173 1.291835 0.90478
C  2.327517 0.948405 -0.249375
C  1.907169 1.422501 -1.479802
C  -0.979649 -1.464382 1.579554
C  -0.580432 -1.490403 -0.782154
C  0.280077 -1.996878 1.809366
C  0.678945 -2.028653 -0.566975
C  1.095709 -2.287804 0.728607
C  -4.7147 -1.04353 -1.307874
C  4.134634 -0.317182 -1.141431
C  1.3727 1.077282 3.252524
C  -5.494232 -1.86902 -0.387028
C  4.969225 0.722322 -1.741722
C  -6.121707 -2.548721 0.378902
C  5.654482 1.57775 -2.232919
H  -1.511215 3.690896 0.475876
H  -0.924581 4.412905 -1.000296
H  -3.231035 3.375404 -1.138564
H  -2.105397 2.949935 -2.407646
H  -3.444781 -0.952442 0.925424
H  -2.347865 0.802162 -1.9190
H  -0.088477 2.362925 1.672906
H  0.485004 2.603028 -2.551829
H  2.443664 1.176318 -2.386434
H  -1.625279 -1.258386 2.424431
H  -0.890212 -1.300918 -1.801577
H  0.610294 -2.193036 2.820636
H  1.322509 -2.249064 -1.40815
H  -5.022868 0.004039 -1.206153
H  -4.932193 -1.337149 -2.336424
H  4.771224 -1.117513 -0.761955
H  3.48274 -0.761377 -1.901876
H  1.88438 0.541068 4.049349
H  1.387789 2.145925 3.485839
H  0.333436 0.739797 3.217509
H  -6.681113 -3.153194 1.057526
H  6.259755 2.34209 -2.666668
elementType: Cl O N C H
totalener: -1705.52477947 hartree
nucrepener: 3018.44913226 hartree
electener: -4723.97391173 hartree
oneelecener: -8336.70456672 hartree
twoeener: 3612.73065498 hartree
cpcmener: -0.04942734 hartree
kineticenergy: 1699.43519778 hartree
xcener: -141.296477426051 hartree
chargesum: -0.0000000
charge: -0.098468 -0.347876 -0.326520 -0.507734 -0.305186 -0.158833 -0.089800 -0.092244 0.000537 0.252819 0.202132 0.133754 -0.178819 -0.294746 0.171177 0.220756 -0.139559 -0.240499 -0.249050 -0.161416 -0.157378 0.133189 0.024680 -0.000400 -0.139248 -0.435125 -0.449939 0.043520 0.076322 0.087964 0.100931 0.113151 0.114877 0.119988 0.185531 0.121027 0.134442 0.132567 0.141068 0.138130 0.143546 0.142336 0.126522 0.126800 0.126722 0.139976 0.125807 0.124669 0.102781 0.281884 0.283234
qa: -0.0985 -0.3479 -0.3265 -0.5077 -0.3052 -0.1588 -0.0898 -0.0922 0.0005 0.2528 0.2021 0.1338 -0.1788 -0.2947 0.1712 0.2208 -0.1396 -0.2405 -0.2490 -0.1614 -0.1574 0.1332 0.0247 -0.0004 -0.1392 -0.4351 -0.4499 0.0435 0.0763 0.0880 0.1009 0.1132 0.1149 0.1200 0.1855 0.1210 0.1344 0.1326 0.1411 0.1381 0.1435 0.1423 0.1265 0.1268 0.1267 0.1400 0.1258 0.1247 0.1028 0.2819 0.2832
va: 1.2088 1.9852 2.0465 2.0142 2.0626 3.1454 3.7642 3.8719 3.6855 3.7429 4.2130 3.4412 3.7987 4.0055 3.9575 3.8308 3.8441 3.9951 3.9927 3.9313 3.9253 3.7496 3.9756 3.9873 3.8691 3.7495 3.8410 3.6233 3.5735 1.0271 1.0085 1.0063 0.9961 1.0181 1.0090 1.0276 1.0030 1.0067 1.0113 1.0217 1.0032 1.0044 0.9905 0.9843 0.9920 0.9805 0.9926 0.9902 0.9850 0.9485 0.9477
dispcorr: -0.034763797 hartree
energy: -1705.559543266219
dipole: -12.79805 11.66991 -1.12814 16.29874 -15.93989 0.35885 -4.49959 2.62887 -1.87072
magnitude: 2.21383 au
magnitude: 5.62712 debye
