program: Orca
programVersion: 5.0.2
elementType: Cl O O O O N C C C C C C C C C C C C C C C C C C C C C C C H H H H H H H H H H H H H H H H H H H H H H
charge: 0
multiplicity: 1
keywords: wb97x-d3
keywords: def2-TZVPP
keywords: def2/J RIJCOSX
keywords: DEFGRID2
keywords: scfconv7
keywords: smallprint printgap noloewdin
keywords: NOSOSCF
formula: C23H22ClNO4
InChI: InChI=1/C23H22ClNO4/c1-4-14-28-20-11-6-17(16-21(20)27-3)12-13-25-23(26)22(29-15-5-2)18-7-9-19(24)10-8-18/h1-2,6-11,16,22,25H,12-15H2,3H3
51 atoms
Cl 2.352577 -2.601676 2.899414
O  -2.732635 -1.558785 -1.241069
O  2.765288 0.751517 1.378289
O  -3.256522 0.874232 1.306368
O  3.480872 0.248125 -1.033058
N  -2.58005 1.106209 -0.839882
C  -1.309754 3.11208 -0.085288
C  -2.507564 2.550338 -0.855208
C  -0.019639 2.398489 -0.388083
C  -2.763833 -1.127275 0.096227
C  -2.90873 0.393629 0.235112
C  -1.474833 -1.521815 0.778692
C  0.773726 1.928765 0.660681
C  0.397048 2.16126 -1.687395
C  1.950437 1.236005 0.422728
C  2.344612 0.978146 -0.90175
C  1.568069 1.451969 -1.944209
C  -0.279628 -1.612715 0.072512
C  -1.467806 -1.755042 2.149144
C  0.900639 -1.946265 0.719698
C  -0.294687 -2.084806 2.809744
C  0.882055 -2.18108 2.0846
C  -3.965944 -1.998283 -1.763353
C  3.928959 -0.088383 -2.32682
C  2.453935 1.027499 2.727877
C  -4.951944 -0.930781 -1.925782
C  4.516163 1.046874 -3.034766
C  -5.763038 -0.056777 -2.071648
C  5.015912 1.969862 -3.618758
H  -1.505884 3.060262 0.986475
H  -1.230732 4.175788 -0.328116
H  -3.429433 2.974886 -0.454054
H  -2.458645 2.848951 -1.901125
H  -3.604095 -1.578475 0.638168
H  -2.281227 0.610199 -1.664148
H  0.444297 2.106152 1.676832
H  -0.18527 2.519339 -2.527849
H  1.851351 1.281984 -2.97437
H  -0.247119 -1.426483 -0.992899
H  -2.388481 -1.690698 2.715408
H  1.824128 -2.01514 0.160681
H  -0.304692 -2.270294 3.875359
H  -3.747518 -2.441488 -2.73678
H  -4.394047 -2.790397 -1.138103
H  4.689169 -0.858272 -2.186403
H  3.130754 -0.536217 -2.928875
H  1.497216 0.593976 3.031383
H  3.244816 0.581056 3.326047
H  2.43215 2.102744 2.927675
H  -6.487213 0.717213 -2.194166
H  5.457718 2.793156 -4.134308
elementType: Cl O N C H
totalener: -1705.52607830 hartree
nucrepener: 2973.19499300 hartree
electener: -4678.72107129 hartree
oneelecener: -8246.04947955 hartree
twoeener: 3567.32840825 hartree
cpcmener: -0.04812662 hartree
kineticenergy: 1699.43533981 hartree
xcener: -141.296788509920 hartree
chargesum: -0.0000000
charge: -0.100833 -0.373582 -0.323532 -0.524243 -0.316750 -0.154656 -0.074490 -0.084793 -0.012754 0.316692 0.211117 0.120880 -0.189726 -0.307771 0.201151 0.213456 -0.139723 -0.281903 -0.227572 -0.106639 -0.137117 0.065391 0.022696 0.010079 -0.151258 -0.423003 -0.425898 0.029838 0.046138 0.084893 0.097818 0.107732 0.115245 0.121566 0.184283 0.123647 0.139700 0.135235 0.139468 0.138078 0.138853 0.141045 0.123690 0.130471 0.132485 0.140529 0.102683 0.126418 0.130388 0.282150 0.282428
qa: -0.1008 -0.3736 -0.3235 -0.5242 -0.3168 -0.1547 -0.0745 -0.0848 -0.0128 0.3167 0.2111 0.1209 -0.1897 -0.3078 0.2012 0.2135 -0.1397 -0.2819 -0.2276 -0.1066 -0.1371 0.0654 0.0227 0.0101 -0.1513 -0.4230 -0.4259 0.0298 0.0461 0.0849 0.0978 0.1077 0.1152 0.1216 0.1843 0.1236 0.1397 0.1352 0.1395 0.1381 0.1389 0.1410 0.1237 0.1305 0.1325 0.1405 0.1027 0.1264 0.1304 0.2821 0.2824
va: 1.2012 1.9557 2.0392 2.0007 2.0558 3.1595 3.7728 3.8790 3.7336 3.6598 4.2285 3.5123 3.8208 3.9981 3.8978 3.8658 3.8470 4.0161 4.0695 3.8637 3.9518 3.7942 3.9933 3.9531 3.8719 3.6741 3.7209 3.6451 3.6321 1.0294 1.0090 1.0130 0.9964 1.0099 1.0172 1.0164 1.0010 1.0063 1.0254 1.0179 1.0196 1.0065 0.9860 0.9852 0.9872 0.9833 0.9798 0.9962 0.9932 0.9489 0.9482
dispcorr: -0.032830114 hartree
energy: -1705.558908411648
dipole: -10.75573 9.79166 -0.96408 13.66085 -13.69535 -0.03449 -10.12604 8.10842 -2.01762
magnitude: 2.23639 au
magnitude: 5.68445 debye
