program: Orca
programVersion: 5.0.2
elementType: Cl O O O O N C C C C C C C C C C C C C C C C C C C C C C C H H H H H H H H H H H H H H H H H H H H H H
charge: 0
multiplicity: 1
keywords: wb97x-d3
keywords: def2-TZVPP
keywords: def2/J RIJCOSX
keywords: DEFGRID2
keywords: scfconv7
keywords: smallprint printgap noloewdin
keywords: NOSOSCF
formula: C23H22ClNO4
InChI: InChI=1/C23H22ClNO4/c1-4-14-28-20-11-6-17(16-21(20)27-3)12-13-25-23(26)22(29-15-5-2)18-7-9-19(24)10-8-18/h1-2,6-11,16,22,25H,12-15H2,3H3
51 atoms
Cl 1.91946 -3.119715 2.555933
O  -2.897819 -0.727483 -1.430334
O  2.505924 0.532712 1.475254
O  -2.788952 1.460382 1.332079
O  3.359121 0.143781 -0.912526
N  -2.484332 1.79255 -0.882159
C  -1.006092 3.640813 -0.050955
C  -2.264354 3.222908 -0.82119
C  0.1774 2.753794 -0.320688
C  -2.812962 -0.474117 -0.051606
C  -2.696073 1.031893 0.188856
C  -1.628258 -1.159409 0.591642
C  0.788656 2.07037 0.732033
C  0.662196 2.562195 -1.603405
C  1.863445 1.22234 0.514304
C  2.332775 1.024248 -0.795705
C  1.729265 1.699723 -1.842262
C  -0.437105 -1.324377 -0.107494
C  -1.708081 -1.605279 1.904657
C  0.653166 -1.938431 0.487948
C  -0.621332 -2.209066 2.51886
C  0.551261 -2.372246 1.799506
C  -3.253434 -2.046456 -1.779678
C  3.847159 -0.164233 -2.198695
C  2.038525 0.643055 2.803657
C  -4.632335 -2.366915 -1.416456
C  4.623919 0.926252 -2.78313
C  -5.764723 -2.62092 -1.105994
C  5.268913 1.819673 -3.260624
H  -1.212664 3.656007 1.018926
H  -0.784147 4.673977 -0.332333
H  -3.13428 3.719505 -0.386049
H  -2.197531 3.56045 -1.853772
H  -3.731633 -0.790337 0.461991
H  -2.386046 1.342046 -1.777472
H  0.402383 2.211262 1.733626
H  0.213969 3.0805 -2.442741
H  2.071905 1.575152 -2.860711
H  -0.343652 -0.979558 -1.129688
H  -2.630247 -1.490287 2.460953
H  1.573101 -2.067887 -0.065611
H  -0.694891 -2.550333 3.542704
H  -3.129868 -2.123828 -2.861354
H  -2.579154 -2.783775 -1.329182
H  4.486353 -1.039078 -2.071933
H  3.038784 -0.45671 -2.878043
H  2.665774 -0.008453 3.407986
H  2.12975 1.664218 3.18506
H  0.998494 0.320771 2.904442
H  -6.770648 -2.854173 -0.836531
H  5.835353 2.624229 -3.673937
elementType: Cl O N C H
totalener: -1705.52699252 hartree
nucrepener: 2981.01679833 hartree
electener: -4686.54379085 hartree
oneelecener: -8261.52935639 hartree
twoeener: 3574.98556553 hartree
cpcmener: -0.04602839 hartree
kineticenergy: 1699.44323822 hartree
xcener: -141.300061016392 hartree
chargesum: 0.0000000
charge: -0.099961 -0.370611 -0.324194 -0.527964 -0.316869 -0.155316 -0.089413 -0.085099 -0.010210 0.270258 0.236667 0.134509 -0.187156 -0.294264 0.207293 0.213790 -0.148338 -0.289281 -0.228303 -0.111374 -0.138320 0.072336 0.010858 0.009740 -0.145854 -0.436342 -0.429132 0.050840 0.051693 0.087361 0.100082 0.112856 0.115428 0.125021 0.180432 0.123826 0.136643 0.135141 0.140000 0.140012 0.138888 0.140856 0.127462 0.134400 0.132218 0.139467 0.121785 0.131633 0.101997 0.281511 0.282997
qa: -0.1000 -0.3706 -0.3242 -0.5280 -0.3169 -0.1553 -0.0894 -0.0851 -0.0102 0.2703 0.2367 0.1345 -0.1872 -0.2943 0.2073 0.2138 -0.1483 -0.2893 -0.2283 -0.1114 -0.1383 0.0723 0.0109 0.0097 -0.1459 -0.4363 -0.4291 0.0508 0.0517 0.0874 0.1001 0.1129 0.1154 0.1250 0.1804 0.1238 0.1366 0.1351 0.1400 0.1400 0.1389 0.1409 0.1275 0.1344 0.1322 0.1395 0.1218 0.1316 0.1020 0.2815 0.2830
va: 1.2039 1.9450 2.0511 1.9920 2.0582 3.1765 3.7559 3.8728 3.7150 3.6906 4.3157 3.3285 3.7991 4.0178 3.9048 3.8642 3.8448 3.9947 4.0808 3.8806 3.9354 3.7966 3.9915 3.9535 3.8746 3.7717 3.7302 3.6167 3.6187 1.0276 1.0091 1.0078 0.9964 1.0083 1.0228 1.0210 1.0021 1.0057 1.0212 1.0110 1.0198 1.0067 0.9849 0.9822 0.9872 0.9838 0.9983 0.9918 0.9823 0.9488 0.9479
dispcorr: -0.033086075 hartree
energy: -1705.560078594787
dipole: -8.49681 7.70192 -0.79489 14.78037 -14.86672 -0.08635 -8.88433 6.81588 -2.06845
magnitude: 2.21761 au
magnitude: 5.63673 debye
