program: Orca
programVersion: 5.0.2
elementType: Cl O O O O N C C C C C C C C C C C C C C C C C C C C C C C H H H H H H H H H H H H H H H H H H H H H H
charge: 0
multiplicity: 1
keywords: wb97x-d3
keywords: def2-TZVPP
keywords: def2/J RIJCOSX
keywords: DEFGRID2
keywords: scfconv7
keywords: smallprint printgap noloewdin
keywords: NOSOSCF
formula: C23H22ClNO4
InChI: InChI=1/C23H22ClNO4/c1-4-14-28-20-11-6-17(16-21(20)27-3)12-13-25-23(26)22(29-15-5-2)18-7-9-19(24)10-8-18/h1-2,6-11,16,22,25H,12-15H2,3H3
51 atoms
Cl 2.864344 -2.707153 0.942809
O  -3.155527 -0.949034 -1.270918
O  1.803407 1.033799 2.096515
O  -2.810151 0.935868 1.722996
O  3.530072 0.687312 0.23336
N  -2.687186 1.594636 -0.446013
C  -1.234142 3.523709 -0.924462
C  -2.486158 3.008703 -0.221704
C  0.024975 2.747198 -0.638829
C  -2.768425 -0.781037 0.068169
C  -2.775919 0.683969 0.525294
C  -1.360781 -1.294511 0.251219
C  0.310095 2.264547 0.64277
C  0.94058 2.510863 -1.648036
C  1.47356 1.560603 0.901995
C  2.409683 1.355773 -0.13002
C  2.131807 1.830956 -1.397048
C  -0.422428 -1.234193 -0.773832
C  -0.969259 -1.77979 1.494268
C  0.878746 -1.668465 -0.568264
C  0.33118 -2.203659 1.717228
C  1.246424 -2.147691 0.678705
C  -4.548511 -0.881296 -1.495988
C  4.591053 0.582786 -0.687578
C  0.88797 1.165149 3.164362
C  -5.256742 -2.040357 -0.956102
C  4.348106 -0.396302 -1.744961
C  -5.834147 -2.99148 -0.503219
C  4.163299 -1.198243 -2.620179
H  -1.107398 4.57139 -0.634364
H  -1.403561 3.532858 -2.004274
H  -2.432541 3.181813 0.851021
H  -3.350769 3.569406 -0.584311
H  -3.435051 -1.327524 0.747292
H  -2.632921 1.265804 -1.399316
H  -0.392343 2.44464 1.44588
H  0.741797 2.860928 -2.653767
H  2.820957 1.676955 -2.216568
H  -0.687637 -0.851329 -1.750543
H  -1.685072 -1.836563 2.304861
H  1.595947 -1.626575 -1.376797
H  0.620267 -2.57979 2.689328
H  -4.989251 0.033977 -1.083697
H  -4.68576 -0.838371 -2.577991
H  4.835816 1.554802 -1.130083
H  5.459575 0.270845 -0.105322
H  1.312039 0.616093 4.002618
H  0.75436 2.20903 3.462745
H  -0.090495 0.739269 2.927442
H  -6.349144 -3.836813 -0.104411
H  3.997785 -1.916552 -3.392214
elementType: Cl O N C H
totalener: -1705.52722583 hartree
nucrepener: 3029.81980431 hartree
electener: -4735.34703014 hartree
oneelecener: -8359.87723812 hartree
twoeener: 3624.53020798 hartree
cpcmener: -0.04738460 hartree
kineticenergy: 1699.42157955 hartree
xcener: -141.297362775755 hartree
chargesum: 0.0000000
charge: -0.094259 -0.361214 -0.327208 -0.516750 -0.304701 -0.170469 -0.084932 -0.042687 -0.009141 0.263576 0.220616 0.190991 -0.238630 -0.266216 0.225272 0.195645 -0.133710 -0.313559 -0.270773 -0.086232 -0.145359 0.076352 0.015968 0.012364 -0.134691 -0.439418 -0.404500 0.053728 0.010171 0.088520 0.089995 0.102424 0.106659 0.120915 0.175601 0.112982 0.133236 0.135755 0.136120 0.138090 0.150704 0.140479 0.128207 0.126805 0.144018 0.134667 0.127006 0.126152 0.095344 0.282396 0.283692
qa: -0.0943 -0.3612 -0.3272 -0.5168 -0.3047 -0.1705 -0.0849 -0.0427 -0.0091 0.2636 0.2206 0.1910 -0.2386 -0.2662 0.2253 0.1956 -0.1337 -0.3136 -0.2708 -0.0862 -0.1454 0.0764 0.0160 0.0124 -0.1347 -0.4394 -0.4045 0.0537 0.0102 0.0885 0.0900 0.1024 0.1067 0.1209 0.1756 0.1130 0.1332 0.1358 0.1361 0.1381 0.1507 0.1405 0.1282 0.1268 0.1440 0.1347 0.1270 0.1262 0.0953 0.2824 0.2837
va: 1.2138 1.9772 2.0488 2.0050 2.0568 3.2074 3.8274 3.8505 3.7144 3.7262 4.2330 3.3796 3.8269 3.9993 3.8975 3.8687 3.8408 4.0584 4.0099 3.8305 3.9387 3.7929 3.9785 3.9355 3.8644 3.7652 3.6322 3.6055 3.6602 1.0069 1.0058 1.0218 1.0021 1.0140 1.0200 1.0346 1.0041 1.0051 1.0284 1.0172 0.9902 1.0064 0.9892 0.9849 0.9868 0.9875 0.9932 0.9894 0.9905 0.9480 0.9484
dispcorr: -0.034883413 hartree
energy: -1705.562109242274
dipole: -14.07560 12.83252 -1.24307 16.58365 -15.38331 1.20034 -4.14953 2.29841 -1.85112
magnitude: 2.53233 au
magnitude: 6.43667 debye
