program: Orca
programVersion: 5.0.2
elementType: Cl O O O O N C C C C C C C C C C C C C C C C C C C C C C C H H H H H H H H H H H H H H H H H H H H H H
charge: 0
multiplicity: 1
keywords: wb97x-d3
keywords: def2-TZVPP
keywords: def2/J RIJCOSX
keywords: DEFGRID2
keywords: scfconv7
keywords: smallprint printgap noloewdin
keywords: NOSOSCF
formula: C23H22ClNO4
InChI: InChI=1/C23H22ClNO4/c1-4-14-28-20-11-6-17(16-21(20)27-3)12-13-25-23(26)22(29-15-5-2)18-7-9-19(24)10-8-18/h1-2,6-11,16,22,25H,12-15H2,3H3
51 atoms
Cl 2.939817 -2.86627 1.073408
O  -3.269684 -1.710787 -0.879877
O  2.061205 0.897278 2.009306
O  -2.950675 1.090637 1.233205
O  3.383186 0.308398 -0.107354
N  -2.6000 0.951196 -0.998672
C  -1.482474 3.158152 -0.565633
C  -2.579232 2.367798 -1.28943
C  -0.170935 2.427469 -0.492667
C  -2.757201 -1.100943 0.279927
C  -2.800431 0.432992 0.212105
C  -1.321623 -1.530387 0.462994
C  0.326772 2.019752 0.746653
C  0.552089 2.11297 -1.630513
C  1.518468 1.321129 0.851434
C  2.240625 1.006008 -0.31301
C  1.749158 1.405339 -1.543713
C  -0.486754 -1.747457 -0.629142
C  -0.806983 -1.688321 1.744443
C  0.827772 -2.14699 -0.445826
C  0.507907 -2.082984 1.942297
C  1.312539 -2.320325 0.840696
C  -4.667493 -1.896711 -0.882262
C  4.125894 -0.126082 -1.22177
C  1.367535 1.166517 3.208916
C  -5.431328 -0.649403 -0.881531
C  4.848291 0.961993 -1.878004
C  -6.063732 0.371993 -0.863248
C  5.455912 1.851177 -2.410094
H  -1.810946 3.416669 0.44035
H  -1.363938 4.104696 -1.099707
H  -3.552428 2.815256 -1.068102
H  -2.436843 2.448088 -2.365571
H  -3.332991 -1.395483 1.166369
H  -2.532665 0.318878 -1.779602
H  -0.241682 2.258498 1.636203
H  0.195661 2.416837 -2.607649
H  2.283096 1.181999 -2.457809
H  -0.848368 -1.620496 -1.641198
H  -1.440614 -1.520225 2.606598
H  1.462371 -2.326849 -1.303306
H  0.891021 -2.212892 2.945563
H  -4.901142 -2.467725 -1.782607
H  -4.978865 -2.504465 -0.024265
H  4.838964 -0.857924 -0.840238
H  3.495176 -0.645587 -1.951559
H  0.362838 0.735085 3.213674
H  1.945549 0.708327 4.009058
H  1.29059 2.239926 3.405287
H  -6.621587 1.281878 -0.848371
H  6.001276 2.64587 -2.869033
elementType: Cl O N C H
totalener: -1705.52398201 hartree
nucrepener: 3031.77546051 hartree
electener: -4737.29944252 hartree
oneelecener: -8363.83348366 hartree
twoeener: 3626.53404113 hartree
cpcmener: -0.04949711 hartree
kineticenergy: 1699.44246820 hartree
xcener: -141.298962936353 hartree
chargesum: 0.0000000
charge: -0.098439 -0.359225 -0.326678 -0.507928 -0.305066 -0.125334 -0.089687 -0.094043 -0.005127 0.324807 0.154045 0.118509 -0.172597 -0.289866 0.161919 0.223088 -0.140464 -0.257938 -0.246537 -0.153286 -0.159348 0.130407 0.019849 -0.002617 -0.138160 -0.415358 -0.447944 0.027174 0.076539 0.087286 0.100282 0.109796 0.115902 0.116906 0.180351 0.120156 0.134523 0.133629 0.138962 0.140340 0.142102 0.143879 0.124124 0.128353 0.126069 0.140662 0.101681 0.126013 0.124590 0.281091 0.282610
qa: -0.0984 -0.3592 -0.3267 -0.5079 -0.3051 -0.1253 -0.0897 -0.0940 -0.0051 0.3248 0.1540 0.1185 -0.1726 -0.2899 0.1619 0.2231 -0.1405 -0.2579 -0.2465 -0.1533 -0.1593 0.1304 0.0198 -0.0026 -0.1382 -0.4154 -0.4479 0.0272 0.0765 0.0873 0.1003 0.1098 0.1159 0.1169 0.1804 0.1202 0.1345 0.1336 0.1390 0.1403 0.1421 0.1439 0.1241 0.1284 0.1261 0.1407 0.1017 0.1260 0.1246 0.2811 0.2826
va: 1.2087 1.9753 2.0466 2.0072 2.0628 3.1033 3.7747 3.8626 3.6834 3.6729 4.2211 3.5004 3.7932 4.0102 3.9628 3.8297 3.8451 3.9991 3.9943 3.9256 3.9281 3.7526 4.0045 3.9869 3.8686 3.6696 3.8333 3.6490 3.5798 1.0263 1.0083 1.0073 0.9959 1.0163 1.0128 1.0289 1.0031 1.0065 1.0215 1.0116 1.0048 1.0034 0.9835 0.9863 0.9925 0.9804 0.9856 0.9926 0.9903 0.9502 0.9481
dispcorr: -0.035269370 hartree
energy: -1705.559251384474
dipole: -14.52854 13.14030 -1.38823 14.38789 -14.61515 -0.22726 -4.41901 2.74200 -1.67701
magnitude: 2.18888 au
magnitude: 5.56370 debye
