program: Orca
programVersion: 5.0.2
elementType: Cl O O O O N C C C C C C C C C C C C C C C C C C C C C C C H H H H H H H H H H H H H H H H H H H H H H
charge: 0
multiplicity: 1
keywords: wb97x-d3
keywords: def2-TZVPP
keywords: def2/J RIJCOSX
keywords: DEFGRID2
keywords: scfconv7
keywords: smallprint printgap noloewdin
keywords: NOSOSCF
formula: C23H22ClNO4
InChI: InChI=1/C23H22ClNO4/c1-4-14-28-20-11-6-17(16-21(20)27-3)12-13-25-23(26)22(29-15-5-2)18-7-9-19(24)10-8-18/h1-2,6-11,16,22,25H,12-15H2,3H3
51 atoms
Cl 2.42611 -3.50074 -1.310375
O  -3.678501 -0.735903 -0.95082
O  2.283688 2.725879 2.54913
O  -1.832607 0.917201 1.538286
O  3.268586 0.712404 1.304614
N  -2.724587 1.656037 -0.410309
C  -1.122339 3.481852 -0.936374
C  -2.420844 3.060417 -0.243328
C  0.079743 2.755535 -0.405885
C  -2.733828 -0.730408 0.086992
C  -2.390321 0.710778 0.470088
C  -1.451204 -1.445318 -0.280976
C  0.639414 3.135499 0.818519
C  0.610127 1.66376 -1.065639
C  1.697294 2.436272 1.370605
C  2.230076 1.326517 0.68442
C  1.679349 0.949039 -0.524938
C  -1.009196 -1.497941 -1.59843
C  -0.676007 -2.029701 0.713218
C  0.178557 -2.135867 -1.923211
C  0.518758 -2.662529 0.406176
C  0.933597 -2.71195 -0.914688
C  -4.281768 -1.985584 -1.203058
C  3.769406 -0.488225 0.76256
C  1.728353 3.7600 3.334521
C  -5.164979 -2.408829 -0.118115
C  4.561842 -0.291372 -0.449323
C  -5.89068 -2.749595 0.776634
C  5.215231 -0.157734 -1.447991
H  -1.011507 4.560581 -0.797937
H  -1.218616 3.311852 -2.011357
H  -2.37332 3.289098 0.82084
H  -3.251949 3.63443 -0.65487
H  -3.148186 -1.189034 0.994846
H  -3.164898 1.375937 -1.272882
H  0.217531 3.985418 1.340951
H  0.197413 1.348609 -2.015893
H  2.064468 0.102414 -1.076995
H  -1.587655 -1.045836 -2.394043
H  -1.005716 -2.003581 1.744258
H  0.508851 -2.175648 -2.952533
H  1.110405 -3.116794 1.189701
H  -4.858421 -1.871305 -2.12262
H  -3.53785 -2.768469 -1.389344
H  4.401539 -0.923452 1.538251
H  2.964132 -1.20411 0.567933
H  0.685292 3.560483 3.596314
H  2.314488 3.800406 4.250441
H  1.789887 4.733645 2.840282
H  -6.544138 -3.057566 1.562237
H  5.790184 -0.030226 -2.338065
elementType: Cl O N C H
totalener: -1705.52728811 hartree
nucrepener: 2956.85060163 hartree
electener: -4662.37788974 hartree
oneelecener: -8213.85789469 hartree
twoeener: 3551.48000495 hartree
cpcmener: -0.05082048 hartree
kineticenergy: 1699.43422697 hartree
xcener: -141.298015282036 hartree
chargesum: -0.0000000
charge: -0.097099 -0.371307 -0.329965 -0.521453 -0.319238 -0.162568 -0.098509 -0.053703 0.022091 0.268759 0.246995 0.168207 -0.233960 -0.251908 0.201258 0.283815 -0.225641 -0.313798 -0.251208 -0.117710 -0.125798 0.068449 0.006276 0.097217 -0.132528 -0.436183 -0.449493 0.052744 0.033818 0.091033 0.089254 0.101077 0.108615 0.122999 0.174548 0.122258 0.136530 0.132074 0.144295 0.137794 0.143995 0.148903 0.128380 0.136156 0.133165 0.084416 0.112027 0.122369 0.108952 0.282000 0.281600
qa: -0.0971 -0.3713 -0.3300 -0.5215 -0.3192 -0.1626 -0.0985 -0.0537 0.0221 0.2688 0.2470 0.1682 -0.2340 -0.2519 0.2013 0.2838 -0.2256 -0.3138 -0.2512 -0.1177 -0.1258 0.0684 0.0063 0.0972 -0.1325 -0.4362 -0.4495 0.0527 0.0338 0.0910 0.0893 0.1011 0.1086 0.1230 0.1745 0.1223 0.1365 0.1321 0.1443 0.1378 0.1440 0.1489 0.1284 0.1362 0.1332 0.0844 0.1120 0.1224 0.1090 0.2820 0.2816
va: 1.2094 1.9504 2.0558 1.9906 2.0696 3.1998 3.8529 3.8466 3.6377 3.6921 4.3035 3.2725 3.8672 3.9855 3.9705 3.8336 3.8719 3.9970 4.0848 3.9267 3.8796 3.8056 3.9946 3.9447 3.8798 3.7632 3.7097 3.6159 3.6539 1.0131 1.0114 1.0199 1.0059 1.0116 1.0241 1.0176 1.0034 1.0048 1.0204 1.0171 1.0046 1.0022 0.9844 0.9817 0.9920 1.0211 0.9882 0.9940 0.9857 0.9484 0.9489
dispcorr: -0.032186189 hartree
energy: -1705.559474293964
dipole: -12.29145 10.24528 -2.04617 18.41580 -18.25307 0.16273 3.15375 -4.69862 -1.54487
magnitude: 2.56903 au
magnitude: 6.52995 debye
