program: Orca
programVersion: 5.0.2
elementType: Cl O O O O N C C C C C C C C C C C C C C C C C C C C C C C H H H H H H H H H H H H H H H H H H H H H H
charge: 0
multiplicity: 1
keywords: wb97x-d3
keywords: def2-TZVPP
keywords: def2/J RIJCOSX
keywords: DEFGRID2
keywords: scfconv7
keywords: smallprint printgap noloewdin
keywords: NOSOSCF
formula: C23H22ClNO4
InChI: InChI=1/C23H22ClNO4/c1-4-14-28-20-11-6-17(16-21(20)27-3)12-13-25-23(26)22(29-15-5-2)18-7-9-19(24)10-8-18/h1-2,6-11,16,22,25H,12-15H2,3H3
51 atoms
Cl 3.050477 -2.629713 1.401981
O  -2.973732 -1.692808 -1.180061
O  2.09458 0.93513 2.04894
O  -3.035764 0.87666 1.246986
O  3.513504 0.852068 -0.080012
N  -2.559799 0.999075 -0.962367
C  -1.62397 3.216844 -0.250405
C  -2.6286 2.437111 -1.105476
C  -0.247434 2.612578 -0.249505
C  -2.642754 -1.183705 0.089612
C  -2.786146 0.342799 0.174131
C  -1.211223 -1.544943 0.40413
C  0.26846 2.060784 0.925093
C  0.523451 2.56024 -1.39841
C  1.525238 1.478646 0.956829
C  2.296642 1.433119 -0.218043
C  1.787486 1.973572 -1.385475
C  -0.229738 -1.535131 -0.58304
C  -0.850313 -1.868029 1.706333
C  1.081663 -1.865264 -0.280778
C  0.459658 -2.195331 2.024389
C  1.415781 -2.195718 1.022938
C  -4.336285 -2.014708 -1.351357
C  4.398851 0.842919 -1.175198
C  1.399895 1.011948 3.275908
C  -5.234095 -0.862608 -1.27951
C  4.024624 -0.131792 -2.197282
C  -5.976158 0.07954 -1.209573
C  3.726955 -0.939913 -3.034685
H  -1.98877 3.296626 0.773075
H  -1.59358 4.235923 -0.645156
H  -3.639814 2.792421 -0.887834
H  -2.44617 2.641285 -2.159215
H  -3.293259 -1.605515 0.865943
H  -2.401963 0.458898 -1.797689
H  -0.335258 2.097929 1.82293
H  0.153636 2.981381 -2.325762
H  2.356973 1.955357 -2.305373
H  -0.470268 -1.277322 -1.606347
H  -1.599092 -1.879985 2.488955
H  1.832268 -1.863271 -1.059816
H  0.723279 -2.451813 3.041622
H  -4.421542 -2.48466 -2.332859
H  -4.654734 -2.75698 -0.60981
H  4.501426 1.837165 -1.623425
H  5.374972 0.577744 -0.766178
H  0.42927 0.510389 3.238717
H  2.021054 0.507864 4.013626
H  1.248969 2.047367 3.595174
H  -6.635908 0.915146 -1.138572
H  3.463148 -1.656729 -3.779731
elementType: Cl O N C H
totalener: -1705.52546361 hartree
nucrepener: 3035.01037928 hartree
electener: -4740.53584289 hartree
oneelecener: -8370.71781935 hartree
twoeener: 3630.18197647 hartree
cpcmener: -0.04858176 hartree
kineticenergy: 1699.43591433 hartree
xcener: -141.297069723754 hartree
chargesum: -0.0000000
charge: -0.095657 -0.362770 -0.322259 -0.512270 -0.308272 -0.131334 -0.086830 -0.096002 -0.012496 0.322157 0.166228 0.131017 -0.189595 -0.288095 0.186516 0.204270 -0.127991 -0.290856 -0.237483 -0.117679 -0.169503 0.111485 0.020610 0.017866 -0.141516 -0.418031 -0.416466 0.029226 0.022147 0.087730 0.100376 0.110423 0.115325 0.118392 0.181359 0.119523 0.135113 0.133897 0.135165 0.139656 0.145789 0.143720 0.123922 0.127891 0.141815 0.133403 0.102589 0.125566 0.127237 0.281175 0.283517
qa: -0.0957 -0.3628 -0.3223 -0.5123 -0.3083 -0.1313 -0.0868 -0.0960 -0.0125 0.3222 0.1662 0.1310 -0.1896 -0.2881 0.1865 0.2043 -0.1280 -0.2909 -0.2375 -0.1177 -0.1695 0.1115 0.0206 0.0179 -0.1415 -0.4180 -0.4165 0.0292 0.0221 0.0877 0.1004 0.1104 0.1153 0.1184 0.1814 0.1195 0.1351 0.1339 0.1352 0.1397 0.1458 0.1437 0.1239 0.1279 0.1418 0.1334 0.1026 0.1256 0.1272 0.2812 0.2835
va: 1.2130 1.9716 2.0532 2.0062 2.0535 3.1090 3.7720 3.8681 3.6976 3.6740 4.2310 3.4884 3.8123 4.0218 3.9288 3.8652 3.8356 4.0388 3.9957 3.8735 3.9159 3.7727 3.9986 3.9391 3.8711 3.6702 3.6549 3.6459 3.6548 1.0287 1.0087 1.0076 0.9963 1.0148 1.0136 1.0287 1.0036 1.0057 1.0237 1.0106 1.0010 1.0045 0.9841 0.9860 0.9849 0.9875 0.9834 0.9933 0.9907 0.9499 0.9480
dispcorr: -0.035075372 hartree
energy: -1705.560538979890
dipole: -14.60107 13.52895 -1.07212 14.13870 -13.89991 0.23879 -5.03767 3.28233 -1.75534
magnitude: 2.07067 au
magnitude: 5.26322 debye
