program: Orca
programVersion: 5.0.2
elementType: Cl O O O O N C C C C C C C C C C C C C C C C C C C C C C C H H H H H H H H H H H H H H H H H H H H H H
charge: 0
multiplicity: 1
keywords: wb97x-d3
keywords: def2-TZVPP
keywords: def2/J RIJCOSX
keywords: DEFGRID2
keywords: scfconv7
keywords: smallprint printgap noloewdin
keywords: NOSOSCF
formula: C23H22ClNO4
InChI: InChI=1/C23H22ClNO4/c1-4-14-28-20-11-6-17(16-21(20)27-3)12-13-25-23(26)22(29-15-5-2)18-7-9-19(24)10-8-18/h1-2,6-11,16,22,25H,12-15H2,3H3
51 atoms
Cl 2.508306 -2.931692 1.218054
O  -3.267456 -0.773727 -1.384408
O  2.063544 0.724987 2.065217
O  -2.922185 1.519265 1.205974
O  3.546886 0.598055 -0.021916
N  -2.457304 1.718065 -0.999149
C  -1.178927 3.708494 -0.140613
C  -2.286855 3.155525 -1.042921
C  0.085649 2.895449 -0.160329
C  -2.841362 -0.49195 -0.073004
C  -2.755739 1.024907 0.099025
C  -1.493984 -1.100447 0.247506
C  0.47105 2.190379 0.981971
C  0.881513 2.809993 -1.2898
C  1.627467 1.428377 1.003692
C  2.429747 1.356346 -0.148745
C  2.046612 2.044507 -1.286544
C  -0.467772 -1.096144 -0.693125
C  -1.259275 -1.661152 1.496262
C  0.764308 -1.657308 -0.400671
C  -0.026556 -2.21706 1.808669
C  0.974486 -2.214128 0.851864
C  -3.571623 -2.127316 -1.637113
C  4.462956 0.542713 -1.090969
C  1.31133 0.779293 3.25905
C  -4.727276 -2.594762 -0.873653
C  4.00454 -0.314523 -2.182273
C  -5.676473 -2.977231 -0.244052
C  3.636411 -1.037507 -3.067883
H  -1.540312 3.79328 0.88353
H  -0.97892 4.728912 -0.477912
H  -3.227494 3.656388 -0.799623
H  -2.064735 3.395309 -2.081445
H  -3.57609 -0.84427 0.661994
H  -2.359684 1.215342 -1.866635
H  -0.154017 2.253532 1.863257
H  0.612495 3.347067 -2.191664
H  2.641562 2.004938 -2.189508
H  -0.617274 -0.663117 -1.674472
H  -2.047928 -1.677125 2.238905
H  1.549854 -1.657625 -1.14471
H  0.142006 -2.652893 2.784364
H  -3.784727 -2.200892 -2.705069
H  -2.71703 -2.783285 -1.435828
H  4.705191 1.541225 -1.471435
H  5.383506 0.131115 -0.673042
H  1.276013 1.790834 3.673917
H  0.288181 0.41884 3.123406
H  1.815425 0.128748 3.970942
H  -6.520641 -3.315811 0.314361
H  3.315809 -1.684032 -3.854494
elementType: Cl O N C H
totalener: -1705.52625820 hartree
nucrepener: 3026.72272994 hartree
electener: -4732.24898814 hartree
oneelecener: -8353.60037044 hartree
twoeener: 3621.35138230 hartree
cpcmener: -0.04648142 hartree
kineticenergy: 1699.43149279 hartree
xcener: -141.296704529396 hartree
chargesum: -0.0000000
charge: -0.093197 -0.362214 -0.322938 -0.523170 -0.309914 -0.156106 -0.089269 -0.094655 -0.007765 0.257268 0.255472 0.142359 -0.198427 -0.290514 0.205434 0.188687 -0.123095 -0.334906 -0.243167 -0.064911 -0.149968 0.081486 0.011601 0.015359 -0.143508 -0.435005 -0.414062 0.046315 0.023562 0.089633 0.100184 0.114194 0.113155 0.116327 0.180100 0.119687 0.136808 0.134719 0.135199 0.141330 0.143473 0.143437 0.129190 0.132933 0.142602 0.133103 0.128158 0.103364 0.125751 0.282565 0.283338
qa: -0.0932 -0.3622 -0.3229 -0.5232 -0.3099 -0.1561 -0.0893 -0.0947 -0.0078 0.2573 0.2555 0.1424 -0.1984 -0.2905 0.2054 0.1887 -0.1231 -0.3349 -0.2432 -0.0649 -0.1500 0.0815 0.0116 0.0154 -0.1435 -0.4350 -0.4141 0.0463 0.0236 0.0896 0.1002 0.1142 0.1132 0.1163 0.1801 0.1197 0.1368 0.1347 0.1352 0.1413 0.1435 0.1434 0.1292 0.1329 0.1426 0.1331 0.1282 0.1034 0.1258 0.2826 0.2833
va: 1.2158 1.9691 2.0548 1.9925 2.0531 3.1701 3.7544 3.8801 3.6809 3.7230 4.2828 3.3051 3.8169 4.0212 3.9067 3.8872 3.8293 4.0331 4.0033 3.8301 3.8984 3.7984 4.0107 3.9404 3.8698 3.7517 3.6536 3.6181 3.6548 1.0266 1.0088 1.0054 0.9969 1.0224 1.0159 1.0295 1.0031 1.0058 1.0227 1.0058 1.0005 1.0053 0.9841 0.9830 0.9842 0.9875 0.9905 0.9840 0.9933 0.9481 0.9482
dispcorr: -0.034685214 hartree
energy: -1705.560943411727
dipole: -10.48917 10.15752 -0.33165 14.52582 -14.45944 0.06639 -4.51739 2.66891 -1.84849
magnitude: 1.87918 au
magnitude: 4.77648 debye
