program: Orca
programVersion: 5.0.2
elementType: Cl O O O O N C C C C C C C C C C C C C C C C C C C C C C C H H H H H H H H H H H H H H H H H H H H H H
charge: 0
multiplicity: 1
keywords: wb97x-d3
keywords: def2-TZVPP
keywords: def2/J RIJCOSX
keywords: DEFGRID2
keywords: scfconv7
keywords: smallprint printgap noloewdin
keywords: NOSOSCF
formula: C23H22ClNO4
InChI: InChI=1/C23H22ClNO4/c1-4-14-28-20-11-6-17(16-21(20)27-3)12-13-25-23(26)22(29-15-5-2)18-7-9-19(24)10-8-18/h1-2,6-11,16,22,25H,12-15H2,3H3
51 atoms
Cl 2.679289 -2.816781 0.849017
O  -3.323996 -0.61266 -1.221613
O  1.784951 0.983193 2.085086
O  -2.712087 1.118057 1.76584
O  3.464777 0.572041 0.194839
N  -2.705902 1.811666 -0.394777
C  -1.154989 3.677681 -0.856785
C  -2.429359 3.210683 -0.156882
C  0.067627 2.836133 -0.598085
C  -2.853694 -0.565807 0.099734
C  -2.769383 0.887271 0.564534
C  -1.472365 -1.163979 0.262091
C  0.342942 2.318366 0.672035
C  0.960814 2.573361 -1.621128
C  1.470901 1.5505 0.905026
C  2.382536 1.314213 -0.14147
C  2.118579 1.829537 -1.395529
C  -0.528105 -1.073053 -0.755092
C  -1.110355 -1.754692 1.467012
C  0.749789 -1.582939 -0.583692
C  0.16961 -2.251478 1.660016
C  1.089509 -2.16509 0.62734
C  -3.665783 -1.896774 -1.694469
C  4.522214 0.452039 -0.728167
C  0.902597 1.164649 3.173047
C  -4.824593 -2.459379 -1.003369
C  4.235828 -0.468773 -1.826587
C  -5.772071 -2.928191 -0.43263
C  4.018876 -1.227751 -2.731801
H  -0.975239 4.710653 -0.54254
H  -1.329065 3.721324 -1.93484
H  -2.365836 3.369625 0.917147
H  -3.266612 3.815733 -0.511481
H  -3.548843 -1.070567 0.783101
H  -2.774856 1.509359 -1.355128
H  -0.340618 2.519623 1.485973
H  0.770915 2.95191 -2.618215
H  2.791098 1.656222 -2.224945
H  -0.777101 -0.607565 -1.700595
H  -1.832585 -1.836031 2.270112
H  1.471655 -1.518733 -1.386642
H  0.438655 -2.708194 2.602995
H  -3.893385 -1.783258 -2.755961
H  -2.825378 -2.596521 -1.620981
H  4.814913 1.428113 -1.131295
H  5.37302 0.074932 -0.1582
H  -0.099738 0.782992 2.96187
H  1.320177 0.602559 4.005943
H  0.824924 2.215665 3.466009
H  -6.618147 -3.34722 0.064976
H  3.821867 -1.896207 -3.540027
elementType: Cl O N C H
totalener: -1705.52713693 hartree
nucrepener: 3037.72128205 hartree
electener: -4743.24841898 hartree
oneelecener: -8375.72642995 hartree
twoeener: 3632.47801097 hartree
cpcmener: -0.04441588 hartree
kineticenergy: 1699.42984666 hartree
xcener: -141.300668775249 hartree
chargesum: 0.0000000
charge: -0.093534 -0.370934 -0.328015 -0.526854 -0.305672 -0.163965 -0.089562 -0.039888 -0.006839 0.269082 0.252616 0.197111 -0.235541 -0.268248 0.232040 0.186361 -0.128909 -0.370602 -0.286333 -0.043424 -0.129404 0.052710 0.011826 0.011571 -0.134343 -0.438610 -0.413241 0.051765 0.019341 0.087202 0.089702 0.101984 0.110164 0.122833 0.170535 0.114559 0.133197 0.135285 0.137775 0.139536 0.151919 0.140439 0.128263 0.134564 0.144473 0.134677 0.095337 0.126978 0.124695 0.281778 0.283600
qa: -0.0935 -0.3709 -0.3280 -0.5269 -0.3057 -0.1640 -0.0896 -0.0399 -0.0068 0.2691 0.2526 0.1971 -0.2355 -0.2682 0.2320 0.1864 -0.1289 -0.3706 -0.2863 -0.0434 -0.1294 0.0527 0.0118 0.0116 -0.1343 -0.4386 -0.4132 0.0518 0.0193 0.0872 0.0897 0.1020 0.1102 0.1228 0.1705 0.1146 0.1332 0.1353 0.1378 0.1395 0.1519 0.1404 0.1283 0.1346 0.1445 0.1347 0.0953 0.1270 0.1247 0.2818 0.2836
va: 1.2146 1.9550 2.0485 1.9899 2.0540 3.2283 3.8387 3.8415 3.7042 3.6908 4.3013 3.2695 3.8256 3.9948 3.8863 3.8768 3.8413 4.0383 4.0399 3.7875 3.9192 3.8210 3.9999 3.9331 3.8634 3.7614 3.6328 3.6152 3.6529 1.0070 1.0064 1.0214 1.0025 1.0145 1.0265 1.0357 1.0040 1.0050 1.0279 1.0129 0.9886 1.0064 0.9837 0.9830 0.9869 0.9878 0.9922 0.9934 0.9896 0.9486 0.9484
dispcorr: -0.035060053 hartree
energy: -1705.562196982857
dipole: -11.74620 11.00677 -0.73943 15.17207 -14.65008 0.52199 -4.10589 2.13270 -1.97319
magnitude: 2.17088 au
magnitude: 5.51794 debye
