program: Orca
programVersion: 5.0.2
elementType: Cl O O O O N C C C C C C C C C C C C C C C C C C C C C C C H H H H H H H H H H H H H H H H H H H H H H
charge: 0
multiplicity: 1
keywords: wb97x-d3
keywords: def2-TZVPP
keywords: def2/J RIJCOSX
keywords: DEFGRID2
keywords: scfconv7
keywords: smallprint printgap noloewdin
keywords: NOSOSCF
formula: C23H22ClNO4
InChI: InChI=1/C23H22ClNO4/c1-4-14-28-20-11-6-17(16-21(20)27-3)12-13-25-23(26)22(29-15-5-2)18-7-9-19(24)10-8-18/h1-2,6-11,16,22,25H,12-15H2,3H3
51 atoms
Cl 2.083847 -3.160247 2.293169
O  -2.840378 -0.709241 -1.454693
O  2.153212 0.777647 1.856456
O  -2.779247 1.55753 1.234326
O  3.550953 0.716544 -0.29984
N  -2.387393 1.810462 -0.981813
C  -1.167616 3.824487 -0.112617
C  -2.282166 3.251248 -0.996166
C  0.114105 3.046327 -0.200288
C  -2.712056 -0.424483 -0.078696
C  -2.633462 1.091156 0.122801
C  -1.504298 -1.096077 0.526156
C  0.536837 2.295144 0.89543
C  0.870148 3.013948 -1.357761
C  1.692002 1.533058 0.848056
C  2.444531 1.500761 -0.338848
C  2.025039 2.239463 -1.430338
C  -0.254115 -0.978782 -0.075967
C  -1.629449 -1.868344 1.671531
C  0.849225 -1.627585 0.451028
C  -0.530354 -2.511451 2.221202
C  0.701927 -2.385601 1.602595
C  -2.998263 -2.069147 -1.77359
C  4.234338 0.452111 -1.493232
C  1.35305 0.646023 3.005514
C  -4.189201 -2.667843 -1.173682
C  3.470058 -0.386819 -2.415165
C  -5.157824 -3.167153 -0.671483
C  2.848505 -1.096844 -3.156292
H  -1.507733 3.854797 0.92105
H  -1.008409 4.862428 -0.418253
H  -3.234354 3.703368 -0.706029
H  -2.104182 3.530682 -2.03482
H  -3.609035 -0.751506 0.463356
H  -2.306233 1.314552 -1.851538
H  -0.076095 2.300615 1.786583
H  0.570971 3.591038 -2.224689
H  2.578809 2.222227 -2.359257
H  -0.12594 -0.370782 -0.963354
H  -2.597751 -1.972873 2.144595
H  1.818584 -1.526088 -0.015938
H  -0.633472 -3.10654 3.118001
H  -3.071688 -2.120972 -2.861496
H  -2.1205 -2.656498 -1.478224
H  4.550387 1.371945 -2.000599
H  5.144621 -0.073714 -1.200744
H  1.845828 -0.088051 3.638878
H  1.267568 1.588237 3.556443
H  0.347428 0.286128 2.768659
H  -6.018472 -3.614117 -0.234709
H  2.300621 -1.726068 -3.815626
totalener: -1705.49394808 hartree
nucrepener: 3027.87812331 hartree
electener: -4733.37207139 hartree
oneelecener: -8354.07607455 hartree
twoeener: 3620.70400316 hartree
kineticenergy: 1699.53449652 hartree
xcener: -141.313873196263 hartree
chargesum: -0.0000000
charge: -0.075428 -0.342483 -0.270621 -0.410488 -0.270335 -0.158736 -0.114017 -0.096719 -0.007106 0.218244 0.211681 0.078115 -0.136308 -0.244476 0.174479 0.202880 -0.113963 -0.236345 -0.141521 -0.087754 -0.130114 0.053186 -0.013133 -0.005164 -0.159635 -0.395394 -0.400817 0.077614 0.061307 0.099081 0.093758 0.105533 0.092796 0.106061 0.150540 0.113733 0.101531 0.101610 0.119846 0.107948 0.123601 0.116184 0.110274 0.122880 0.120915 0.121725 0.116554 0.118147 0.099269 0.246578 0.244488
qa: -0.0754 -0.3425 -0.2706 -0.4105 -0.2703 -0.1587 -0.1140 -0.0967 -0.0071 0.2182 0.2117 0.0781 -0.1363 -0.2445 0.1745 0.2029 -0.1140 -0.2363 -0.1415 -0.0878 -0.1301 0.0532 -0.0131 -0.0052 -0.1596 -0.3954 -0.4008 0.0776 0.0613 0.0991 0.0938 0.1055 0.0928 0.1061 0.1505 0.1137 0.1015 0.1016 0.1198 0.1079 0.1236 0.1162 0.1103 0.1229 0.1209 0.1217 0.1166 0.1181 0.0993 0.2466 0.2445
va: 1.2329 1.9758 2.1101 2.1157 2.0996 3.1269 3.7672 3.9123 3.7375 3.8048 4.3376 3.4638 3.8032 4.0774 3.9402 3.9051 3.8957 3.9582 4.0173 3.8738 3.9814 3.9408 4.0445 3.9637 3.9055 3.8066 3.7382 3.6746 3.7223 1.0251 1.0070 1.0099 0.9960 1.0219 1.0433 1.0263 1.0097 1.0142 1.0225 1.0150 1.0266 1.0176 0.9843 0.9818 0.9808 0.9870 0.9972 0.9919 0.9815 0.9713 0.9737
dispcorr: -0.034989969 hartree
energy: -1705.528938044352
dipole: -9.67719 9.33848 -0.33870 14.58278 -14.71280 -0.13002 -8.38126 7.04915 -1.33211
magnitude: 1.38063 au
magnitude: 3.50929 debye
