program: Orca
programVersion: 5.0.2
elementType: Cl O O O O N C C C C C C C C C C C C C C C C C C C C C C C H H H H H H H H H H H H H H H H H H H H H H
charge: 0
multiplicity: 1
keywords: wb97x-d3
keywords: def2-TZVPP
keywords: def2/J RIJCOSX
keywords: DEFGRID2
keywords: scfconv7
keywords: smallprint printgap noloewdin
keywords: NOSOSCF
formula: C23H22ClNO4
InChI: InChI=1/C23H22ClNO4/c1-4-14-28-20-11-6-17(16-21(20)27-3)12-13-25-23(26)22(29-15-5-2)18-7-9-19(24)10-8-18/h1-2,6-11,16,22,25H,12-15H2,3H3
51 atoms
Cl 2.505467 -3.565564 0.704127
O  -3.252997 -0.393227 -0.558691
O  1.555484 0.565909 -2.792956
O  -1.855017 1.099682 2.318438
O  3.057336 0.179498 -0.74617
N  -2.656034 1.965703 0.375994
C  -1.23439 3.841517 -0.370058
C  -2.292387 3.338734 0.617926
C  -0.047499 2.921892 -0.453515
C  -2.6407 -0.450746 0.707087
C  -2.339166 0.963645 1.216186
C  -1.358765 -1.25015 0.690877
C  0.21507 2.213951 -1.626938
C  0.770431 2.709191 0.639245
C  1.26248 1.311186 -1.706387
C  2.081287 1.100261 -0.584685
C  1.82689 1.807768 0.575797
C  -0.543375 -1.267787 -0.43362
C  -0.957358 -1.946229 1.82323
C  0.646293 -1.978541 -0.440882
C  0.231358 -2.656661 1.835984
C  1.022332 -2.669391 0.698324
C  -3.848891 -1.596244 -0.978397
C  3.83325 -0.182314 0.367296
C  0.806507 0.771982 -3.959134
C  -5.016891 -1.961824 -0.1790
C  4.821048 0.830448 0.732903
C  -5.974373 -2.262389 0.478516
C  5.644456 1.647856 1.036964
H  -0.930174 4.8458 -0.06189
H  -1.682954 3.955468 -1.361198
H  -1.92009 3.401187 1.638622
H  -3.180224 3.974831 0.563528
H  -3.328386 -0.88987 1.443781
H  -3.041972 1.717313 -0.519171
H  -0.426319 2.37844 -2.483807
H  0.589048 3.232529 1.569137
H  2.446869 1.679109 1.451773
H  -0.829244 -0.718711 -1.320585
H  -1.57487 -1.931059 2.71176
H  1.278392 -1.974871 -1.317289
H  0.537738 -3.198181 2.720163
H  -4.149865 -1.447313 -2.017169
H  -3.129976 -2.424681 -0.966808
H  3.204035 -0.423051 1.232599
H  4.344249 -1.103442 0.085219
H  1.218148 0.106285 -4.71459
H  -0.253479 0.528611 -3.823878
H  0.879925 1.801589 -4.324024
H  -6.823994 -2.529113 1.059881
H  6.370187 2.378821 1.300525
totalener: -1705.49388206 hartree
nucrepener: 2996.56710646 hartree
electener: -4702.06098851 hartree
oneelecener: -8291.38643420 hartree
twoeener: 3589.32544569 hartree
kineticenergy: 1699.52057243 hartree
xcener: -141.309520202792 hartree
chargesum: 0.0000000
charge: -0.090960 -0.354963 -0.278888 -0.403231 -0.271189 -0.171940 -0.152969 -0.054422 0.054846 0.214679 0.228137 0.136126 -0.203014 -0.196015 0.154713 0.253141 -0.106356 -0.247930 -0.166343 -0.100076 -0.110292 0.039753 -0.028315 -0.059545 -0.142889 -0.407885 -0.407572 0.102945 0.114147 0.093479 0.073246 0.102613 0.095735 0.106842 0.141938 0.086845 0.097539 0.102813 0.119658 0.108139 0.126457 0.119857 0.109999 0.126798 0.129295 0.118015 0.119784 0.081961 0.106617 0.245873 0.242802
qa: -0.0910 -0.3550 -0.2789 -0.4032 -0.2712 -0.1719 -0.1530 -0.0544 0.0548 0.2147 0.2281 0.1361 -0.2030 -0.1960 0.1547 0.2531 -0.1064 -0.2479 -0.1663 -0.1001 -0.1103 0.0398 -0.0283 -0.0595 -0.1429 -0.4079 -0.4076 0.1029 0.1141 0.0935 0.0732 0.1026 0.0957 0.1068 0.1419 0.0868 0.0975 0.1028 0.1197 0.1081 0.1265 0.1199 0.1100 0.1268 0.1293 0.1180 0.1198 0.0820 0.1066 0.2459 0.2428
va: 1.2157 1.9405 2.0892 2.1278 2.0962 3.1652 3.8600 3.8531 3.7168 3.7473 4.3308 3.4896 3.9179 4.0600 3.9434 3.8642 3.9320 4.0053 4.1082 3.8817 3.9861 3.9035 4.0176 4.0318 3.9111 3.8399 3.8955 3.6564 3.6293 1.0137 1.0092 1.0284 1.0061 1.0093 1.0518 1.0241 1.0150 1.0172 1.0156 1.0213 1.0288 1.0122 0.9844 0.9821 0.9775 0.9926 0.9970 0.9824 0.9894 0.9714 0.9731
dispcorr: -0.033007497 hartree
energy: -1705.526889552339
dipole: -12.95995 11.80742 -1.15253 17.31839 -16.98881 0.32958 -7.79483 6.77786 -1.01698
magnitude: 1.57200 au
magnitude: 3.99570 debye
