program: Orca
programVersion: 5.0.2
elementType: Cl O O O O N C C C C C C C C C C C C C C C C C C C C C C C H H H H H H H H H H H H H H H H H H H H H H
charge: 0
multiplicity: 1
keywords: wb97x-d3
keywords: def2-TZVPP
keywords: def2/J RIJCOSX
keywords: DEFGRID2
keywords: scfconv7
keywords: smallprint printgap noloewdin
keywords: NOSOSCF
formula: C23H22ClNO4
InChI: InChI=1/C23H22ClNO4/c1-4-14-28-20-11-6-17(16-21(20)27-3)12-13-25-23(26)22(29-15-5-2)18-7-9-19(24)10-8-18/h1-2,6-11,16,22,25H,12-15H2,3H3
51 atoms
Cl 2.63451 -2.746005 0.013578
O  -3.575925 -0.458518 -1.001295
O  1.872465 0.916747 1.836665
O  -2.533023 1.093107 1.970202
O  3.328569 0.533993 -0.237727
N  -2.876379 1.908427 -0.122598
C  -1.315794 3.734912 -0.687148
C  -2.519207 3.279761 0.138214
C  -0.100817 2.84783 -0.596203
C  -2.9350 -0.491248 0.250351
C  -2.781189 0.92969 0.792376
C  -1.549155 -1.091139 0.174991
C  0.306127 2.297184 0.622979
C  0.660541 2.591536 -1.719024
C  1.440767 1.512251 0.716599
C  2.228529 1.290385 -0.430997
C  1.824576 1.827062 -1.638199
C  -0.75348 -0.893679 -0.946826
C  -1.026982 -1.792786 1.253613
C  0.528573 -1.412013 -1.003013
C  0.263176 -2.296273 1.218239
C  1.034373 -2.106814 0.083034
C  -3.970856 -1.715521 -1.493729
C  4.107806 0.221018 -1.360184
C  1.066918 0.998273 2.986654
C  -5.041095 -2.323621 -0.705781
C  5.242119 -0.587106 -0.940446
C  -5.918115 -2.824974 -0.058745
C  6.196208 -1.249756 -0.646801
H  -1.062539 4.751726 -0.369308
H  -1.610241 3.822637 -1.737159
H  -2.32333 3.372074 1.204613
H  -3.368338 3.934221 -0.076141
H  -3.538183 -1.042912 0.982978
H  -3.103373 1.644345 -1.066719
H  -0.290886 2.468547 1.507919
H  0.367618 3.000283 -2.678513
H  2.398964 1.663467 -2.540299
H  -1.124885 -0.329147 -1.791857
H  -1.631795 -1.944256 2.138811
H  1.133881 -1.266971 -1.886732
H  0.66462 -2.835789 2.064716
H  -4.319107 -1.551412 -2.51525
H  -3.123256 -2.409787 -1.547984
H  3.525106 -0.336586 -2.105847
H  4.479532 1.128209 -1.855127
H  0.993013 2.022914 3.365528
H  0.057052 0.618078 2.810463
H  1.551913 0.38532 3.742985
H  -6.698896 -3.266321 0.512594
H  7.035401 -1.839962 -0.368055
totalener: -1705.49235046 hartree
nucrepener: 3035.72126151 hartree
electener: -4741.21361197 hartree
oneelecener: -8369.78826686 hartree
twoeener: 3628.57465489 hartree
kineticenergy: 1699.53268566 hartree
xcener: -141.315089723669 hartree
chargesum: 0.0000000
charge: -0.070410 -0.350398 -0.271895 -0.422013 -0.242673 -0.166963 -0.135445 -0.050275 0.051102 0.252592 0.224846 0.156549 -0.212154 -0.251785 0.229716 0.201972 -0.131868 -0.292259 -0.240867 -0.103756 -0.127925 0.124908 -0.028328 -0.168602 -0.147072 -0.406163 -0.418318 0.099711 0.234886 0.084291 0.075682 0.102861 0.101458 0.111736 0.140884 0.099047 0.097560 0.106878 0.111207 0.115992 0.118004 0.118984 0.110795 0.127461 0.110759 0.116320 0.105972 0.105675 0.115952 0.245623 0.239748
qa: -0.0704 -0.3504 -0.2719 -0.4220 -0.2427 -0.1670 -0.1354 -0.0503 0.0511 0.2526 0.2248 0.1565 -0.2122 -0.2518 0.2297 0.2020 -0.1319 -0.2923 -0.2409 -0.1038 -0.1279 0.1249 -0.0283 -0.1686 -0.1471 -0.4062 -0.4183 0.0997 0.2349 0.0843 0.0757 0.1029 0.1015 0.1117 0.1409 0.0990 0.0976 0.1069 0.1112 0.1160 0.1180 0.1190 0.1108 0.1275 0.1108 0.1163 0.1060 0.1057 0.1160 0.2456 0.2397
va: 1.2444 1.9628 2.1076 2.0984 2.1109 3.1936 3.8624 3.8489 3.7010 3.7436 4.3185 3.3875 3.8699 4.0391 3.9435 3.9056 3.8714 4.0312 4.0439 3.9215 3.9735 3.8661 4.0358 4.0447 3.8894 3.8311 4.0820 3.6551 3.4032 1.0068 1.0072 1.0217 1.0020 1.0150 1.0480 1.0387 1.0122 1.0124 1.0374 1.0189 1.0028 1.0117 0.9840 0.9820 0.9734 0.9826 0.9918 0.9884 0.9940 0.9715 0.9738
dispcorr: -0.035235491 hartree
energy: -1705.527585951692
dipole: -12.57557 11.71078 -0.86479 14.60812 -14.44097 0.16715 -1.56842 0.48180 -1.08663
magnitude: 1.39877 au
magnitude: 3.55538 debye
