program: Orca
programVersion: 5.0.2
elementType: Cl O O O O N C C C C C C C C C C C C C C C C C C C C C C C H H H H H H H H H H H H H H H H H H H H H H
charge: 0
multiplicity: 1
keywords: wb97x-d3
keywords: def2-TZVPP
keywords: def2/J RIJCOSX
keywords: DEFGRID2
keywords: scfconv7
keywords: smallprint printgap noloewdin
keywords: NOSOSCF
formula: C23H22ClNO4
InChI: InChI=1/C23H22ClNO4/c1-4-14-28-20-11-6-17(16-21(20)27-3)12-13-25-23(26)22(29-15-5-2)18-7-9-19(24)10-8-18/h1-2,6-11,16,22,25H,12-15H2,3H3
51 atoms
Cl 2.342739 -3.319977 0.786424
O  -3.477838 -0.430195 -0.949461
O  2.053148 0.526921 1.251907
O  -2.259553 1.210224 1.918308
O  3.237721 -0.016693 -1.175977
N  -2.645156 1.933537 -0.199002
C  -1.054106 3.675389 -0.948213
C  -2.202503 3.293394 -0.013195
C  0.099058 2.706067 -0.972573
C  -2.906613 -0.430463 0.335128
C  -2.584164 1.001508 0.765799
C  -1.624544 -1.226117 0.407393
C  0.568473 2.10957 0.19596
C  0.719301 2.392708 -2.171505
C  1.614445 1.196753 0.173153
C  2.253363 0.912747 -1.04382
C  1.798491 1.519703 -2.198383
C  -0.691155 -1.161542 -0.62154
C  -1.327382 -1.971208 1.539976
C  0.51817 -1.82799 -0.522183
C  -0.112473 -2.627035 1.66196
C  0.807127 -2.540224 0.62999
C  -3.987036 -1.673228 -1.367339
C  4.355079 -0.008705 -0.30623
C  1.370215 0.685105 2.473722
C  -5.111142 -2.13192 -0.553179
C  4.881797 1.324991 -0.048386
C  -6.027418 -2.511558 0.121855
C  5.315557 2.423531 0.160515
H  -0.706416 4.670983 -0.654328
H  -1.437859 3.789414 -1.966122
H  -1.911767 3.401469 1.029732
H  -3.03576 3.983307 -0.172676
H  -3.61902 -0.819728 1.074788
H  -2.932048 1.639122 -1.117713
H  0.077913 2.326656 1.135108
H  0.373261 2.839607 -3.095504
H  2.291948 1.284121 -3.132527
H  -0.888862 -0.570502 -1.506968
H  -2.045278 -2.029926 2.348208
H  1.244532 -1.767181 -1.319258
H  0.117728 -3.194505 2.553023
H  -4.313527 -1.541375 -2.40054
H  -3.207256 -2.444701 -1.368773
H  4.130895 -0.507225 0.638543
H  5.116166 -0.604115 -0.814687
H  1.834841 -0.005824 3.173314
H  1.469539 1.70108 2.86798
H  0.30881 0.441365 2.386519
H  -6.843391 -2.845438 0.716607
H  5.690562 3.400457 0.347418
totalener: -1705.49435559 hartree
nucrepener: 3037.59419483 hartree
electener: -4743.08855042 hartree
oneelecener: -8373.63597179 hartree
twoeener: 3630.54742137 hartree
kineticenergy: 1699.52005572 hartree
xcener: -141.312475196033 hartree
chargesum: -0.0000000
charge: -0.085126 -0.350838 -0.310325 -0.421035 -0.316587 -0.165958 -0.129302 -0.052836 0.043599 0.254112 0.209501 0.109772 -0.240215 -0.192816 0.430737 0.017265 -0.129287 -0.269134 -0.194133 -0.070943 -0.126269 0.071162 -0.021722 0.036086 -0.154872 -0.400469 -0.397300 0.089307 0.068273 0.084638 0.076586 0.104173 0.101307 0.107203 0.143423 0.105754 0.098062 0.115665 0.121487 0.108281 0.130686 0.117975 0.111184 0.125395 0.109600 0.108462 0.110612 0.114611 0.114660 0.246396 0.243196
qa: -0.0851 -0.3508 -0.3103 -0.4210 -0.3166 -0.1660 -0.1293 -0.0528 0.0436 0.2541 0.2095 0.1098 -0.2402 -0.1928 0.4307 0.0173 -0.1293 -0.2691 -0.1941 -0.0709 -0.1263 0.0712 -0.0217 0.0361 -0.1549 -0.4005 -0.3973 0.0893 0.0683 0.0846 0.0766 0.1042 0.1013 0.1072 0.1434 0.1058 0.0981 0.1157 0.1215 0.1083 0.1307 0.1180 0.1112 0.1254 0.1096 0.1085 0.1106 0.1146 0.1147 0.2464 0.2432
va: 1.2217 1.9621 2.0453 2.1020 2.0214 3.1852 3.8676 3.8440 3.7104 3.7462 4.3444 3.4452 3.8771 3.9904 3.5943 3.9056 4.0577 3.9914 4.0560 3.8815 3.9830 3.8896 4.0322 3.9520 3.8927 3.8225 3.8515 3.6661 3.6778 1.0075 1.0063 1.0234 1.0018 1.0171 1.0480 1.0347 1.0100 1.0152 1.0282 1.0187 1.0185 1.0144 0.9844 0.9828 0.9976 0.9826 0.9943 0.9942 0.9845 0.9712 0.9733
dispcorr: -0.035612778 hartree
energy: -1705.529968372000
dipole: -10.49393 9.59073 -0.90320 16.58932 -16.23667 0.35265 -1.06406 0.61614 -0.44792
magnitude: 1.06807 au
magnitude: 2.71481 debye
