program: Orca
programVersion: 5.0.2
elementType: Cl O O O O N C C C C C C C C C C C C C C C C C C C C C C C H H H H H H H H H H H H H H H H H H H H H H
charge: 0
multiplicity: 1
keywords: wb97x-d3
keywords: def2-TZVPP
keywords: def2/J RIJCOSX
keywords: DEFGRID2
keywords: scfconv7
keywords: smallprint printgap noloewdin
keywords: NOSOSCF
formula: C23H22ClNO4
InChI: InChI=1/C23H22ClNO4/c1-4-14-28-20-11-6-17(16-21(20)27-3)12-13-25-23(26)22(29-15-5-2)18-7-9-19(24)10-8-18/h1-2,6-11,16,22,25H,12-15H2,3H3
51 atoms
Cl 1.869281 -3.257564 2.456107
O  -3.023687 -0.749231 -1.320169
O  2.359921 0.482012 1.472457
O  -2.719285 1.561935 1.322152
O  3.397173 0.167853 -0.857805
N  -2.478249 1.762325 -0.921104
C  -1.004127 3.656951 -0.202628
C  -2.251116 3.188016 -0.960733
C  0.191979 2.774482 -0.421418
C  -2.858291 -0.437062 0.043766
C  -2.681666 1.074413 0.211131
C  -1.675593 -1.155072 0.647091
C  0.711718 2.045033 0.647219
C  0.784392 2.640115 -1.663427
C  1.803126 1.207356 0.490131
C  2.377676 1.05916 -0.784928
C  1.86768 1.784219 -1.847264
C  -0.461605 -1.204717 -0.031594
C  -1.778433 -1.767493 1.88718
C  0.627082 -1.864757 0.511486
C  -0.693832 -2.423066 2.449908
C  0.502057 -2.46752 1.753302
C  -3.424159 -2.071693 -1.577596
C  3.993732 -0.080276 -2.100978
C  1.774635 0.53197 2.749836
C  -4.763853 -2.365548 -1.071061
C  4.839659 1.011997 -2.577009
C  -5.860453 -2.602702 -0.645742
C  5.549441 1.892445 -2.975974
H  -1.230531 3.707161 0.861228
H  -0.78897 4.680442 -0.522812
H  -3.124312 3.719586 -0.574211
H  -2.163395 3.452941 -2.014606
H  -3.763664 -0.69517 0.609733
H  -2.467035 1.248354 -1.783937
H  0.228803 2.135141 1.611052
H  0.418693 3.209106 -2.510013
H  2.31466 1.718369 -2.829915
H  -0.352171 -0.715383 -0.991393
H  -2.716159 -1.732026 2.427128
H  1.574104 -1.88481 -0.008575
H  -0.77888 -2.895402 3.418742
H  -3.409902 -2.192908 -2.662303
H  -2.712728 -2.795698 -1.161535
H  4.607602 -0.97135 -1.959385
H  3.245965 -0.325986 -2.866229
H  1.840569 1.531536 3.191416
H  0.725432 0.221793 2.735827
H  2.334107 -0.164332 3.369958
H  -6.832837 -2.819727 -0.27345
H  6.17305 2.680971 -3.322369
totalener: -1705.49391996 hartree
nucrepener: 2979.90449202 hartree
electener: -4685.39841198 hartree
oneelecener: -8258.00445218 hartree
twoeener: 3572.60604019 hartree
kineticenergy: 1699.53471607 hartree
xcener: -141.312795081769 hartree
chargesum: 0.0000000
charge: -0.077610 -0.346514 -0.268456 -0.409191 -0.271189 -0.158433 -0.113834 -0.093266 -0.014104 0.231725 0.209035 0.069369 -0.120459 -0.248937 0.159220 0.237430 -0.133594 -0.228370 -0.141041 -0.107893 -0.129530 0.055895 -0.022391 -0.045072 -0.160563 -0.398591 -0.397354 0.086858 0.100896 0.097262 0.094678 0.106248 0.093645 0.110437 0.150841 0.110481 0.102254 0.105087 0.118193 0.109821 0.123573 0.117750 0.110320 0.123779 0.118275 0.119641 0.118787 0.096504 0.117593 0.246141 0.244651
qa: -0.0776 -0.3465 -0.2685 -0.4092 -0.2712 -0.1584 -0.1138 -0.0933 -0.0141 0.2317 0.2090 0.0694 -0.1205 -0.2489 0.1592 0.2374 -0.1336 -0.2284 -0.1410 -0.1079 -0.1295 0.0559 -0.0224 -0.0451 -0.1606 -0.3986 -0.3974 0.0869 0.1009 0.0973 0.0947 0.1062 0.0936 0.1104 0.1508 0.1105 0.1023 0.1051 0.1182 0.1098 0.1236 0.1178 0.1103 0.1238 0.1183 0.1196 0.1188 0.0965 0.1176 0.2461 0.2447
va: 1.2301 1.9609 2.1091 2.1185 2.1022 3.1296 3.7605 3.9114 3.7560 3.7676 4.3342 3.4801 3.7906 4.0761 3.9580 3.8690 3.9112 3.9979 4.0506 3.8877 3.9747 3.9111 4.0307 4.0194 3.9063 3.8161 3.7978 3.6707 3.6533 1.0265 1.0069 1.0105 0.9960 1.0177 1.0439 1.0255 1.0094 1.0176 1.0251 1.0154 1.0299 1.0168 0.9847 0.9829 0.9863 0.9812 0.9920 0.9799 1.0000 0.9714 0.9721
dispcorr: -0.033361877 hartree
energy: -1705.527281840673
dipole: -8.77106 8.24263 -0.52843 14.97219 -15.08124 -0.10905 -8.83678 7.56773 -1.26905
magnitude: 1.37899 au
magnitude: 3.50512 debye
