program: Orca
programVersion: 5.0.2
elementType: Cl O O O O N C C C C C C C C C C C C C C C C C C C C C C C H H H H H H H H H H H H H H H H H H H H H H
charge: 0
multiplicity: 1
keywords: wb97x-d3
keywords: def2-TZVPP
keywords: def2/J RIJCOSX
keywords: DEFGRID2
keywords: scfconv7
keywords: smallprint printgap noloewdin
keywords: NOSOSCF
formula: C23H22ClNO4
InChI: InChI=1/C23H22ClNO4/c1-4-14-28-20-11-6-17(16-21(20)27-3)12-13-25-23(26)22(29-15-5-2)18-7-9-19(24)10-8-18/h1-2,6-11,16,22,25H,12-15H2,3H3
51 atoms
Cl 2.438984 -2.891638 0.974431
O  -3.437327 -0.346651 -1.017295
O  1.764486 0.960588 2.027865
O  -2.611308 1.417632 1.910689
O  3.302876 0.338691 0.076369
N  -2.742439 2.064787 -0.26321
C  -1.080766 3.793961 -0.857609
C  -2.351043 3.440585 -0.083096
C  0.083544 2.864172 -0.633348
C  -2.941452 -0.294759 0.298049
C  -2.76308 1.162878 0.732301
C  -1.602615 -0.979463 0.448655
C  0.372957 2.360929 0.637619
C  0.903867 2.505357 -1.685252
C  1.444497 1.511875 0.848911
C  2.282257 1.171569 -0.230522
C  2.004466 1.672916 -1.486567
C  -0.671552 -0.952089 -0.580915
C  -1.263474 -1.591206 1.647291
C  0.569747 -1.544883 -0.427581
C  -0.020452 -2.178417 1.81867
C  0.890831 -2.151158 0.775767
C  -4.227667 -1.466142 -1.321904
C  4.319883 0.135201 -0.862855
C  0.898638 1.167112 3.11686
C  -3.499414 -2.732325 -1.352495
C  3.956741 -0.763655 -1.95908
C  -2.921085 -3.782386 -1.381156
C  3.700023 -1.503432 -2.868264
H  -0.804698 4.818759 -0.58815
H  -1.305794 3.824671 -1.927837
H  -2.220499 3.607202 0.984253
H  -3.159626 4.104409 -0.401137
H  -3.660064 -0.739316 1.000539
H  -2.88301 1.726742 -1.200664
H  -0.265355 2.622205 1.47027
H  0.700424 2.873692 -2.68341
H  2.613038 1.403961 -2.339408
H  -0.905627 -0.472175 -1.521352
H  -1.975641 -1.611756 2.462734
H  1.288064 -1.525289 -1.234962
H  0.23644 -2.654286 2.754949
H  -5.062906 -1.555036 -0.613902
H  -4.663907 -1.274991 -2.304477
H  4.67798 1.085765 -1.278435
H  5.149554 -0.307594 -0.309263
H  0.874259 2.216523 3.429146
H  -0.122467 0.8430 2.900358
H  1.293295 0.571973 3.937317
H  -2.388483 -4.702615 -1.392988
H  3.466774 -2.166168 -3.666531
totalener: -1705.49101599 hartree
nucrepener: 3077.30873262 hartree
electener: -4782.79974861 hartree
oneelecener: -8453.65970074 hartree
twoeener: 3670.85995213 hartree
kineticenergy: 1699.53606838 hartree
xcener: -141.317456784631 hartree
chargesum: -0.0000000
charge: -0.082192 -0.356262 -0.271662 -0.418170 -0.259213 -0.166953 -0.133213 -0.047487 0.029562 0.274241 0.207039 0.153446 -0.193548 -0.238208 0.210478 0.173523 -0.096233 -0.258727 -0.235140 -0.066885 -0.131933 0.099858 -0.039566 -0.029500 -0.147710 -0.385147 -0.421094 0.096216 0.092009 0.083307 0.076196 0.103024 0.099729 0.100233 0.142193 0.098139 0.096577 0.110055 0.099171 0.106385 0.123342 0.114410 0.111532 0.108148 0.127002 0.120821 0.106691 0.107060 0.114959 0.243461 0.250036
qa: -0.0822 -0.3563 -0.2717 -0.4182 -0.2592 -0.1670 -0.1332 -0.0475 0.0296 0.2742 0.2070 0.1534 -0.1935 -0.2382 0.2105 0.1735 -0.0962 -0.2587 -0.2351 -0.0669 -0.1319 0.0999 -0.0396 -0.0295 -0.1477 -0.3851 -0.4211 0.0962 0.0920 0.0833 0.0762 0.1030 0.0997 0.1002 0.1422 0.0981 0.0966 0.1101 0.0992 0.1064 0.1233 0.1144 0.1115 0.1081 0.1270 0.1208 0.1067 0.1071 0.1150 0.2435 0.2500
va: 1.2274 1.9505 2.1104 2.1050 2.1001 3.1852 3.8635 3.8466 3.7194 3.7043 4.3590 3.4034 3.8394 4.0567 3.9596 3.8983 3.8839 4.0024 4.0253 3.8453 3.9744 3.8639 4.0450 3.9919 3.8878 3.7179 3.7254 3.6755 3.6527 1.0070 1.0066 1.0221 1.0019 1.0100 1.0475 1.0379 1.0120 1.0148 1.0415 1.0225 1.0023 1.0150 0.9843 0.9851 0.9858 0.9882 0.9919 0.9875 0.9939 0.9732 0.9700
dispcorr: -0.036381817 hartree
energy: -1705.527397808897
dipole: -11.86540 11.10199 -0.76341 15.86580 -15.58486 0.28094 -4.16496 3.00441 -1.16054
magnitude: 1.41725 au
magnitude: 3.60235 debye
