program: Orca
programVersion: 5.0.2
elementType: O O O N N C C C C C C C C C C C C C C C C C C H H H H H H H H H H H H H H H H H H H H H H H H H H H H
charge: 0
multiplicity: 1
keywords: wb97x-d3
keywords: def2-TZVPP
keywords: def2/J RIJCOSX
keywords: DEFGRID2
keywords: scfconv7
keywords: smallprint printgap noloewdin
keywords: NOSOSCF
formula: C18H28N2O3
InChI: InChI=1/C18H28N2O3/c1-11(2)16(20-18(22)23-12(3)4)17(21)19-14(6)15-9-7-13(5)8-10-15/h7-12,14,16,19-20H,1-6H3
51 atoms
O  1.889426 -1.754244 -1.709538
O  -0.234902 2.267286 0.331484
O  0.098411 0.946128 -1.471982
N  1.185034 -1.581534 0.43744
N  1.68624 1.18185 0.119265
C  2.564982 0.192806 -0.468299
C  3.834621 0.043362 0.384751
C  1.837248 -1.142274 -0.647878
C  0.137076 -2.5945 0.405817
C  4.71317 -1.088717 -0.134323
C  4.623305 1.348697 0.4122
C  -1.201985 -1.891092 0.331518
C  0.268944 -3.532091 1.594791
C  0.478311 1.432416 -0.419901
C  -1.917608 -1.849234 -0.860996
C  -1.705026 -1.192264 1.425063
C  -3.601767 -0.420736 0.131562
C  -3.098929 -1.127714 -0.959082
C  -2.887357 -0.473478 1.325699
C  -1.53024 2.694077 -0.151398
C  -4.859966 0.387068 0.015455
C  -1.370069 3.786468 -1.189781
C  -2.299406 3.165369 1.062696
H  2.865676 0.511692 -1.470921
H  3.527826 -0.198566 1.408952
H  0.27619 -3.173814 -0.506282
H  5.637115 -1.134258 0.442422
H  4.984968 -0.933272 -1.180146
H  4.237621 -2.066059 -0.049661
H  4.931196 1.639082 -0.594348
H  4.059796 2.177057 0.84232
H  5.524879 1.228723 1.01376
H  1.163415 -0.967943 1.241207
H  1.901855 1.546906 1.035798
H  0.21684 -2.998603 2.544759
H  -0.529953 -4.272933 1.581705
H  1.220496 -4.062019 1.558954
H  -1.543462 -2.381319 -1.727923
H  -1.172007 -1.195853 2.368957
H  -3.63233 -1.106304 -1.902439
H  -3.255992 0.064184 2.191321
H  -2.042416 1.834179 -0.589235
H  -5.07801 0.919409 0.940599
H  -4.78476 1.12663 -0.783453
H  -5.72073 -0.24267 -0.215795
H  -0.853572 4.652722 -0.773248
H  -0.821049 3.445531 -2.066967
H  -2.353755 4.114425 -1.526655
H  -2.383841 2.382256 1.816318
H  -3.308596 3.44705 0.762852
H  -1.831301 4.038385 1.520758
elementType: O N C H
totalener: -1038.15551701 hartree
nucrepener: 2131.87933769 hartree
electener: -3170.03485470 hartree
oneelecener: -5649.90338889 hartree
twoeener: 2479.86853419 hartree
cpcmener: -0.05950587 hartree
kineticenergy: 1033.40606843 hartree
xcener: -101.565801406136 hartree
chargesum: -0.0000000
charge: -0.547598 -0.339533 -0.551160 -0.163472 -0.239536 0.100186 0.044413 0.262653 0.198025 -0.307075 -0.291059 -0.000316 -0.284143 0.499098 -0.217040 -0.184034 -0.039297 -0.133584 -0.198150 0.180767 -0.222991 -0.269927 -0.279887 0.102876 0.060650 0.076658 0.095822 0.095918 0.093622 0.089116 0.093377 0.095249 0.171529 0.181125 0.092964 0.099016 0.101567 0.138590 0.147453 0.140408 0.145916 0.053572 0.094641 0.101836 0.116778 0.094602 0.095489 0.099677 0.102927 0.095973 0.106308
qa: -0.5476 -0.3395 -0.5512 -0.1635 -0.2395 0.1002 0.0444 0.2627 0.1980 -0.3071 -0.2911 -0.0003 -0.2841 0.4991 -0.2170 -0.1840 -0.0393 -0.1336 -0.1981 0.1808 -0.2230 -0.2699 -0.2799 0.1029 0.0607 0.0767 0.0958 0.0959 0.0936 0.0891 0.0934 0.0952 0.1715 0.1811 0.0930 0.0990 0.1016 0.1386 0.1475 0.1404 0.1459 0.0536 0.0946 0.1018 0.1168 0.0946 0.0955 0.0997 0.1029 0.0960 0.1063
va: 1.9542 2.0751 1.9368 3.1842 3.1842 3.7428 3.8605 4.1716 3.7484 3.9477 3.9439 3.5532 3.9609 4.3266 3.9307 3.9183 3.6564 3.8726 3.8799 3.7751 3.8923 3.9313 3.9223 1.0325 1.0209 1.0429 1.0043 1.0040 1.0109 1.0020 1.0093 1.0042 1.0214 1.0166 1.0020 1.0049 1.0060 1.0079 1.0005 0.9988 0.9969 1.0296 1.0031 0.9943 0.9973 1.0073 1.0169 1.0050 1.0057 1.0031 1.0086
dispcorr: -0.029684959 hartree
energy: -1038.185201971649
dipole: 1.42597 -1.70131 -0.27535 7.97374 -6.52983 1.44391 7.58171 -4.21212 3.36959
magnitude: 3.67626 au
magnitude: 9.34430 debye
