program: Orca
programVersion: 5.0.2
elementType: O O O N N C C C C C C C C C C C C C C C C C C H H H H H H H H H H H H H H H H H H H H H H H H H H H H
charge: 0
multiplicity: 1
keywords: wb97x-d3
keywords: def2-TZVPP
keywords: def2/J RIJCOSX
keywords: DEFGRID2
keywords: scfconv7
keywords: smallprint printgap noloewdin
keywords: NOSOSCF
formula: C18H28N2O3
InChI: InChI=1/C18H28N2O3/c1-11(2)16(20-18(22)23-12(3)4)17(21)19-14(6)15-9-7-13(5)8-10-15/h7-12,14,16,19-20H,1-6H3
51 atoms
O  2.160682 -1.658574 -1.672169
O  0.255228 2.892791 0.303955
O  0.361056 1.634614 -1.573485
N  0.960915 -1.125192 0.170786
N  1.915177 1.452154 0.061026
C  2.668665 0.423889 -0.616098
C  4.019447 0.217068 0.100007
C  1.891097 -0.884177 -0.755562
C  0.117688 -2.310288 0.21582
C  3.888326 -0.402658 1.488045
C  5.001007 -0.579506 -0.750019
C  -1.33892 -1.907226 0.145395
C  0.440531 -3.148225 1.445996
C  0.80051 1.971405 -0.487283
C  -2.094931 -2.19168 -0.984827
C  -1.953476 -1.224437 1.193746
C  -4.041753 -1.118007 -0.02847
C  -3.426682 -1.805163 -1.069871
C  -3.281356 -0.838332 1.106868
C  -1.011517 3.478388 -0.074628
C  -5.467044 -0.663618 -0.128401
C  -1.131499 4.755359 0.727383
C  -2.145975 2.513166 0.208822
H  2.886251 0.751188 -1.636739
H  4.433408 1.224333 0.214029
H  0.349053 -2.896937 -0.672781
H  4.853596 -0.377324 1.993839
H  3.576226 -1.44733 1.4353
H  3.178371 0.125728 2.127729
H  5.096132 -0.16421 -1.753989
H  5.988722 -0.556775 -0.288893
H  4.712494 -1.626066 -0.841574
H  0.824881 -0.441634 0.902928
H  2.231299 1.79427 0.956751
H  1.479888 -3.476981 1.420522
H  0.286719 -2.586143 2.368098
H  -0.193745 -4.033797 1.481598
H  -1.640856 -2.723835 -1.812407
H  -1.394303 -0.986113 2.091548
H  -3.993284 -2.042885 -1.962439
H  -3.735229 -0.307554 1.935742
H  -0.9853 3.722673 -1.139132
H  -6.003164 -0.815465 0.808545
H  -5.522159 0.402298 -0.358732
H  -6.002644 -1.19476 -0.914248
H  -1.159316 4.55286 1.799272
H  -0.30568 5.436889 0.523058
H  -2.05625 5.266338 0.460317
H  -2.062597 1.595692 -0.372253
H  -3.095346 2.98124 -0.05277
H  -2.182522 2.251427 1.267378
elementType: O N C H
totalener: -1038.15544911 hartree
nucrepener: 2077.93879153 hartree
electener: -3116.09424065 hartree
oneelecener: -5541.59511075 hartree
twoeener: 2425.50087011 hartree
cpcmener: -0.05515276 hartree
kineticenergy: 1033.39737090 hartree
xcener: -101.564953542941 hartree
chargesum: 0.0000000
charge: -0.564933 -0.338878 -0.557191 -0.168303 -0.240091 0.094722 0.066812 0.275428 0.195424 -0.312824 -0.318005 -0.038203 -0.295867 0.521596 -0.153605 -0.169381 0.016423 -0.176220 -0.255702 0.174126 -0.200996 -0.261017 -0.258315 0.111098 0.061151 0.068860 0.107989 0.086003 0.096990 0.098925 0.099314 0.082144 0.179725 0.180706 0.102807 0.095285 0.104689 0.143209 0.148319 0.142767 0.143024 0.069299 0.099163 0.101496 0.094104 0.090023 0.098254 0.092637 0.072954 0.106140 0.087925
qa: -0.5649 -0.3389 -0.5572 -0.1683 -0.2401 0.0947 0.0668 0.2754 0.1954 -0.3128 -0.3180 -0.0382 -0.2959 0.5216 -0.1536 -0.1694 0.0164 -0.1762 -0.2557 0.1741 -0.2010 -0.2610 -0.2583 0.1111 0.0612 0.0689 0.1080 0.0860 0.0970 0.0989 0.0993 0.0821 0.1797 0.1807 0.1028 0.0953 0.1047 0.1432 0.1483 0.1428 0.1430 0.0693 0.0992 0.1015 0.0941 0.0900 0.0983 0.0926 0.0730 0.1061 0.0879
va: 1.9523 2.0861 1.9435 3.2183 3.1817 3.8214 3.8318 4.1707 3.7192 3.9504 3.9502 3.6135 3.9561 4.3032 3.9400 3.8753 3.6715 3.9252 3.9155 3.8350 3.8966 3.9455 3.8852 1.0357 1.0165 1.0595 1.0051 1.0044 1.0065 1.0029 1.0024 1.0120 1.0151 1.0182 1.0035 1.0018 1.0067 1.0021 1.0011 1.0004 1.0011 1.0200 0.9990 0.9937 1.0039 1.0058 1.0081 1.0048 1.0224 1.0079 1.0055
dispcorr: -0.027451151 hartree
energy: -1038.182900262462
dipole: -0.30281 -0.19770 -0.50051 3.34891 -1.89476 1.45415 10.38074 -7.11046 3.27028
magnitude: 3.61383 au
magnitude: 9.18563 debye
