program: Orca
programVersion: 5.0.2
elementType: O O O N N C C C C C C C C C C C C C C C C C C H H H H H H H H H H H H H H H H H H H H H H H H H H H H
charge: 0
multiplicity: 1
keywords: wb97x-d3
keywords: def2-TZVPP
keywords: def2/J RIJCOSX
keywords: DEFGRID2
keywords: scfconv7
keywords: smallprint printgap noloewdin
keywords: NOSOSCF
formula: C18H28N2O3
InChI: InChI=1/C18H28N2O3/c1-11(2)16(20-18(22)23-12(3)4)17(21)19-14(6)15-9-7-13(5)8-10-15/h7-12,14,16,19-20H,1-6H3
51 atoms
O  2.016495 -1.730279 -1.664128
O  0.170978 2.84421 0.170501
O  0.142059 1.330922 -1.507994
N  1.046393 -1.209434 0.314921
N  1.852718 1.416719 -0.032446
C  2.603053 0.370424 -0.688076
C  3.990617 0.233075 -0.028729
C  1.843843 -0.954964 -0.725068
C  0.178254 -2.370811 0.446322
C  3.946125 -0.261779 1.413066
C  4.926065 -0.63281 -0.862431
C  -1.264571 -1.922087 0.309307
C  0.494129 -3.111743 1.734956
C  0.673088 1.831927 -0.53111
C  -2.144716 -1.861156 1.382725
C  -1.725758 -1.508619 -0.940255
C  -3.900456 -0.966136 -0.027615
C  -3.442183 -1.390795 1.214597
C  -3.019303 -1.042473 -1.10641
C  -1.140514 3.346395 -0.177089
C  -5.280113 -0.403367 -0.193572
C  -1.199741 4.763092 0.350126
C  -2.214352 2.458398 0.419887
H  2.76923 0.642247 -1.734821
H  4.401637 1.248442 -0.02677
H  0.406264 -3.031238 -0.39064
H  4.937968 -0.180012 1.858914
H  3.650446 -1.310346 1.471947
H  3.265341 0.313831 2.042718
H  4.643327 -1.685681 -0.837306
H  4.952153 -0.314054 -1.905176
H  5.940879 -0.561543 -0.470984
H  0.954204 -0.501092 1.029705
H  2.264566 1.909043 0.747088
H  -0.159321 -3.975137 1.857421
H  1.522794 -3.470335 1.714806
H  0.380585 -2.4729 2.611971
H  -1.8332 -2.182052 2.368659
H  -1.065441 -1.558047 -1.798769
H  -4.106732 -1.35571 2.070254
H  -3.349439 -0.730026 -2.090362
H  -1.235695 3.365084 -1.264783
H  -5.985661 -0.850728 0.506398
H  -5.281878 0.67371 -0.0092
H  -5.659677 -0.557844 -1.203332
H  -1.098841 4.793197 1.436104
H  -0.421251 5.387348 -0.089258
H  -2.161867 5.205032 0.092274
H  -2.15855 1.435515 0.046943
H  -3.197415 2.849747 0.15565
H  -2.14547 2.434775 1.508652
elementType: O N C H
totalener: -1038.15473098 hartree
nucrepener: 2096.21908682 hartree
electener: -3134.37381780 hartree
oneelecener: -5578.52577495 hartree
twoeener: 2444.15195715 hartree
cpcmener: -0.05282406 hartree
kineticenergy: 1033.39183221 hartree
xcener: -101.566018409717 hartree
chargesum: 0.0000000
charge: -0.567430 -0.341166 -0.555917 -0.150676 -0.236506 0.095508 0.070289 0.279509 0.183594 -0.315293 -0.320414 -0.026206 -0.311397 0.523175 -0.157372 -0.226901 -0.048820 -0.168270 -0.148720 0.174210 -0.207519 -0.263564 -0.221241 0.113898 0.060752 0.091767 0.107328 0.084188 0.098524 0.082848 0.099702 0.100362 0.174433 0.178636 0.110753 0.103483 0.093306 0.146500 0.145042 0.141137 0.138057 0.068357 0.098800 0.100156 0.097525 0.089928 0.098038 0.093154 0.030700 0.101591 0.092163
qa: -0.5674 -0.3412 -0.5559 -0.1507 -0.2365 0.0955 0.0703 0.2795 0.1836 -0.3153 -0.3204 -0.0262 -0.3114 0.5232 -0.1574 -0.2269 -0.0488 -0.1683 -0.1487 0.1742 -0.2075 -0.2636 -0.2212 0.1139 0.0608 0.0918 0.1073 0.0842 0.0985 0.0828 0.0997 0.1004 0.1744 0.1786 0.1108 0.1035 0.0933 0.1465 0.1450 0.1411 0.1381 0.0684 0.0988 0.1002 0.0975 0.0899 0.0980 0.0932 0.0307 0.1016 0.0922
va: 1.9404 2.0905 1.9423 3.1905 3.1832 3.8304 3.8335 4.1481 3.7095 3.9506 3.9468 3.6843 3.9697 4.2981 3.9254 3.9072 3.7195 3.9330 3.8451 3.8370 3.8979 3.9484 3.9018 1.0340 1.0152 1.0426 1.0048 1.0061 1.0068 1.0098 1.0036 1.0024 1.0180 1.0187 1.0022 1.0049 0.9991 0.9984 1.0175 1.0002 1.0022 1.0220 1.0015 0.9924 1.0017 1.0060 1.0078 1.0045 1.0352 1.0087 1.0104
dispcorr: -0.028260330 hartree
energy: -1038.182991306307
dipole: 0.43634 -0.57911 -0.14277 4.68605 -2.93448 1.75157 9.90853 -6.79814 3.11039
magnitude: 3.57252 au
magnitude: 9.08063 debye
