program: Orca
programVersion: 5.0.2
elementType: O O O N N C C C C C C C C C C C C C C C C C C H H H H H H H H H H H H H H H H H H H H H H H H H H H H
charge: 0
multiplicity: 1
keywords: wb97x-d3
keywords: def2-TZVPP
keywords: def2/J RIJCOSX
keywords: DEFGRID2
keywords: scfconv7
keywords: smallprint printgap noloewdin
keywords: NOSOSCF
formula: C18H28N2O3
InChI: InChI=1/C18H28N2O3/c1-11(2)16(20-18(22)23-12(3)4)17(21)19-14(6)15-9-7-13(5)8-10-15/h7-12,14,16,19-20H,1-6H3
51 atoms
O  2.036813 -1.588693 -1.73999
O  0.198713 2.827147 0.437011
O  0.186351 1.492311 -1.387852
N  1.042592 -1.178843 0.252741
N  1.89361 1.446288 0.09426
C  2.633011 0.440568 -0.63162
C  4.020868 0.247965 0.012835
C  1.861496 -0.872048 -0.756031
C  0.156217 -2.333454 0.296899
C  3.974381 -0.353579 1.413276
C  4.951263 -0.557084 -0.884061
C  -1.278498 -1.873404 0.114212
C  0.408812 -3.129437 1.566556
C  0.710429 1.895774 -0.362966
C  -1.689436 -1.419341 -1.139931
C  -2.203525 -1.851209 1.149328
C  -3.914214 -0.948065 -0.310537
C  -2.980794 -0.967173 -1.348535
C  -3.500641 -1.394513 0.938248
C  -1.148971 3.288846 0.190518
C  -5.317696 -0.476341 -0.545304
C  -1.264728 4.630595 0.879408
C  -2.145835 2.275156 0.716642
H  2.79792 0.781683 -1.657531
H  4.435707 1.258262 0.09059
H  0.4165 -2.962923 -0.554649
H  3.290288 0.170759 2.082621
H  4.96439 -0.303514 1.867452
H  3.681039 -1.40388 1.391849
H  5.967244 -0.518483 -0.489918
H  4.664573 -1.607536 -0.936712
H  4.977112 -0.161277 -1.900104
H  0.951993 -0.518896 1.012333
H  2.284848 1.842479 0.936742
H  1.434626 -3.496447 1.57662
H  0.261396 -2.526814 2.463779
H  -0.255662 -3.99122 1.624004
H  -0.990493 -1.427209 -1.968517
H  -1.929947 -2.192401 2.139398
H  -3.270016 -0.622876 -2.334686
H  -4.199927 -1.38883 1.766122
H  -1.287243 3.4253 -0.8841
H  -5.903002 -1.228391 -1.078245
H  -5.831551 -0.267862 0.3923
H  -5.339392 0.430912 -1.149661
H  -2.257478 5.043707 0.702634
H  -1.126736 4.541683 1.958019
H  -0.536175 5.343609 0.492604
H  -2.043229 1.306498 0.227498
H  -3.15975 2.630314 0.529441
H  -2.033233 2.133357 1.792604
elementType: O N C H
totalener: -1038.15492105 hartree
nucrepener: 2099.11535276 hartree
electener: -3137.27027381 hartree
oneelecener: -5584.30994568 hartree
twoeener: 2447.03967187 hartree
cpcmener: -0.05291437 hartree
kineticenergy: 1033.40162134 hartree
xcener: -101.568258597508 hartree
chargesum: -0.0000000
charge: -0.567566 -0.340405 -0.554416 -0.150309 -0.236753 0.095286 0.068817 0.280888 0.186836 -0.314809 -0.319604 -0.035909 -0.312771 0.520022 -0.222567 -0.148776 -0.037446 -0.151697 -0.179871 0.172923 -0.210367 -0.263888 -0.208199 0.113435 0.061419 0.091744 0.097788 0.107371 0.084613 0.100074 0.082159 0.099698 0.173202 0.179585 0.103376 0.093538 0.110819 0.144730 0.146217 0.139724 0.141117 0.068223 0.106242 0.093699 0.098511 0.092993 0.090177 0.097798 0.017621 0.102211 0.092495
qa: -0.5676 -0.3404 -0.5544 -0.1503 -0.2368 0.0953 0.0688 0.2809 0.1868 -0.3148 -0.3196 -0.0359 -0.3128 0.5200 -0.2226 -0.1488 -0.0374 -0.1517 -0.1799 0.1729 -0.2104 -0.2639 -0.2082 0.1134 0.0614 0.0917 0.0978 0.1074 0.0846 0.1001 0.0822 0.0997 0.1732 0.1796 0.1034 0.0935 0.1108 0.1447 0.1462 0.1397 0.1411 0.0682 0.1062 0.0937 0.0985 0.0930 0.0902 0.0978 0.0176 0.1022 0.0925
va: 1.9402 2.0883 1.9449 3.1906 3.1845 3.8324 3.8336 4.1448 3.7098 3.9519 3.9470 3.6800 3.9721 4.3040 3.9035 3.9066 3.7046 3.8596 3.9242 3.8381 3.8968 3.9504 3.8982 1.0340 1.0154 1.0413 1.0069 1.0048 1.0062 1.0023 1.0104 1.0034 1.0191 1.0184 1.0050 0.9988 1.0021 1.0176 0.9982 1.0011 1.0012 1.0219 0.9945 1.0043 0.9982 1.0045 1.0057 1.0080 1.0372 1.0088 1.0107
dispcorr: -0.028430497 hartree
energy: -1038.183351544235
dipole: 0.09770 -0.31776 -0.22006 3.16611 -1.78839 1.37772 10.45060 -7.19893 3.25167
magnitude: 3.53835 au
magnitude: 8.99376 debye
