program: Orca
programVersion: 5.0.2
elementType: O O O N N C C C C C C C C C C C C C C C C C C H H H H H H H H H H H H H H H H H H H H H H H H H H H H
charge: 0
multiplicity: 1
keywords: wb97x-d3
keywords: def2-TZVPP
keywords: def2/J RIJCOSX
keywords: DEFGRID2
keywords: scfconv7
keywords: smallprint printgap noloewdin
keywords: NOSOSCF
formula: C18H28N2O3
InChI: InChI=1/C18H28N2O3/c1-11(2)16(20-18(22)23-12(3)4)17(21)19-14(6)15-9-7-13(5)8-10-15/h7-12,14,16,19-20H,1-6H3
51 atoms
O  1.998188 -1.777943 -1.613547
O  0.201093 2.851262 0.197879
O  0.127135 1.345361 -1.487008
N  1.039607 -1.194157 0.352897
N  1.862741 1.407025 -0.038634
C  2.590937 0.354303 -0.707915
C  4.000675 0.229087 -0.097434
C  1.833406 -0.973908 -0.69806
C  0.162729 -2.3445 0.515728
C  4.005646 -0.28123 1.339437
C  4.919807 -0.615798 -0.969063
C  -1.276832 -1.898978 0.338774
C  0.454885 -3.039035 1.835187
C  0.679833 1.836197 -0.517498
C  -2.182793 -1.822166 1.38851
C  -1.709326 -1.508255 -0.928681
C  -3.915918 -0.985278 -0.0843
C  -3.481843 -1.371643 1.178054
C  -3.002435 -1.06066 -1.136556
C  -1.110868 3.366538 -0.124049
C  -5.323317 -0.524492 -0.318082
C  -1.153314 4.775625 0.424846
C  -2.182962 2.477392 0.474872
H  2.7148 0.613066 -1.763729
H  4.39949 1.248911 -0.097723
H  0.400494 -3.037047 -0.291998
H  5.007882 -0.190167 1.758366
H  3.726504 -1.333982 1.39309
H  3.334136 0.276766 1.993645
H  4.636341 -1.667599 -0.966821
H  4.927139 -0.270462 -2.002716
H  5.940238 -0.555563 -0.593243
H  0.948236 -0.461286 1.04265
H  2.292741 1.896681 0.732695
H  -0.198907 -3.899386 1.975048
H  1.484597 -3.394945 1.847152
H  0.323478 -2.370446 2.687118
H  -1.891105 -2.112326 2.389734
H  -1.025176 -1.56139 -1.76782
H  -4.165912 -1.320642 2.017009
H  -3.308748 -0.76422 -2.132936
H  -1.220731 3.401822 -1.209946
H  -5.946594 -1.339139 -0.692822
H  -5.783987 -0.160172 0.599409
H  -5.364362 0.275035 -1.057861
H  -1.0409 4.78807 1.510055
H  -0.373776 5.399684 -0.012831
H  -2.114076 5.22967 0.183817
H  -2.137548 1.458229 0.090103
H  -3.166929 2.876239 0.226707
H  -2.101642 2.440513 1.562374
elementType: O N C H
totalener: -1038.15487215 hartree
nucrepener: 2094.20579483 hartree
electener: -3132.36066698 hartree
oneelecener: -5574.52349287 hartree
twoeener: 2442.16282588 hartree
cpcmener: -0.05217624 hartree
kineticenergy: 1033.40736932 hartree
xcener: -101.568918815523 hartree
chargesum: 0.0000000
charge: -0.566836 -0.341101 -0.555068 -0.150322 -0.234636 0.096310 0.070972 0.278867 0.185938 -0.313481 -0.320089 -0.035035 -0.311583 0.522005 -0.153907 -0.226744 -0.038113 -0.172259 -0.154459 0.171185 -0.209003 -0.263453 -0.216727 0.113082 0.058971 0.091733 0.107160 0.084516 0.097885 0.082398 0.099497 0.099695 0.174515 0.178904 0.110174 0.103004 0.093455 0.146470 0.146160 0.141560 0.138100 0.067999 0.106570 0.094874 0.097177 0.089961 0.097965 0.093168 0.029342 0.101536 0.091667
qa: -0.5668 -0.3411 -0.5551 -0.1503 -0.2346 0.0963 0.0710 0.2789 0.1859 -0.3135 -0.3201 -0.0350 -0.3116 0.5220 -0.1539 -0.2267 -0.0381 -0.1723 -0.1545 0.1712 -0.2090 -0.2635 -0.2167 0.1131 0.0590 0.0917 0.1072 0.0845 0.0979 0.0824 0.0995 0.0997 0.1745 0.1789 0.1102 0.1030 0.0935 0.1465 0.1462 0.1416 0.1381 0.0680 0.1066 0.0949 0.0972 0.0900 0.0980 0.0932 0.0293 0.1015 0.0917
va: 1.9414 2.0892 1.9431 3.1892 3.1828 3.8230 3.8328 4.1497 3.7086 3.9506 3.9478 3.6931 3.9721 4.2979 3.9186 3.9061 3.7059 3.9331 3.8556 3.8369 3.8960 3.9487 3.9003 1.0346 1.0159 1.0421 1.0049 1.0060 1.0068 1.0116 1.0030 1.0023 1.0191 1.0185 1.0019 1.0053 0.9989 0.9984 1.0176 1.0005 1.0026 1.0218 0.9942 1.0030 0.9997 1.0059 1.0079 1.0045 1.0363 1.0090 1.0104
dispcorr: -0.028087493 hartree
energy: -1038.182959643825
dipole: 0.50872 -0.63239 -0.12368 4.63021 -2.88083 1.74938 9.58024 -6.55316 3.02708
magnitude: 3.49841 au
magnitude: 8.89224 debye
