program: Orca
programVersion: 5.0.2
elementType: O O O N N C C C C C C C C C C C C C C C C C C H H H H H H H H H H H H H H H H H H H H H H H H H H H H
charge: 0
multiplicity: 1
keywords: wb97x-d3
keywords: def2-TZVPP
keywords: def2/J RIJCOSX
keywords: DEFGRID2
keywords: scfconv7
keywords: smallprint printgap noloewdin
keywords: NOSOSCF
formula: C18H28N2O3
InChI: InChI=1/C18H28N2O3/c1-11(2)16(20-18(22)23-12(3)4)17(21)19-14(6)15-9-7-13(5)8-10-15/h7-12,14,16,19-20H,1-6H3
51 atoms
O  2.047577 -1.759205 -1.675089
O  -0.204091 2.315837 0.365802
O  0.122984 1.210861 -1.577271
N  1.171627 -1.330583 0.369739
N  1.757998 1.349135 -0.020341
C  2.580707 0.357624 -0.678499
C  3.991556 0.318791 -0.063532
C  1.899871 -1.015751 -0.708794
C  0.21724 -2.430671 0.451122
C  4.0373 -0.173474 1.379229
C  4.942618 -0.498659 -0.929824
C  -1.1748 -1.841812 0.336665
C  0.45974 -3.245808 1.710002
C  0.518665 1.601831 -0.492958
C  -1.930767 -1.487222 1.447086
C  -1.681725 -1.541338 -0.927067
C  -3.648399 -0.516797 0.03981
C  -3.150471 -0.836091 1.298114
C  -2.894979 -0.891316 -1.073503
C  -1.554709 2.680516 -0.005324
C  -4.945516 0.216346 -0.125686
C  -1.536753 3.936521 -0.852212
C  -2.319129 2.860738 1.287674
H  2.699737 0.644376 -1.725941
H  4.338344 1.356887 -0.080775
H  0.391254 -3.070807 -0.413513
H  5.044617 -0.044033 1.775927
H  3.795308 -1.234492 1.451347
H  3.364284 0.369254 2.045439
H  4.940993 -0.157177 -1.965846
H  5.961028 -0.405264 -0.552495
H  4.691993 -1.5602 -0.923884
H  1.082568 -0.635559 1.098174
H  1.984776 1.634751 0.921545
H  -0.285456 -4.034866 1.808347
H  1.442328 -3.714665 1.669383
H  0.422326 -2.631114 2.610213
H  -1.574914 -1.703738 2.446711
H  -1.109082 -1.808541 -1.80796
H  -3.716223 -0.562391 2.181005
H  -3.258904 -0.659781 -2.067963
H  -2.000022 1.857706 -0.568897
H  -5.326408 0.576779 0.828958
H  -4.831579 1.076181 -0.787462
H  -5.712066 -0.423906 -0.566466
H  -1.092426 4.771921 -0.308579
H  -0.984968 3.794884 -1.781473
H  -2.557679 4.213738 -1.115714
H  -3.360843 3.088592 1.061633
H  -1.918055 3.682844 1.882978
H  -2.303385 1.953293 1.892067
elementType: O N C H
totalener: -1038.15355241 hartree
nucrepener: 2132.27660202 hartree
electener: -3170.43015443 hartree
oneelecener: -5650.36358724 hartree
twoeener: 2479.93343281 hartree
cpcmener: -0.05357998 hartree
kineticenergy: 1033.39743067 hartree
xcener: -101.565205427596 hartree
chargesum: 0.0000000
charge: -0.556301 -0.336525 -0.551522 -0.157536 -0.248599 0.122450 0.063508 0.257459 0.172400 -0.313136 -0.319164 -0.012844 -0.297020 0.505276 -0.140316 -0.216974 -0.017432 -0.223347 -0.167565 0.179434 -0.216112 -0.268256 -0.277938 0.108869 0.062597 0.088875 0.106243 0.085422 0.098765 0.099957 0.099419 0.083970 0.173464 0.180785 0.108262 0.102499 0.089995 0.148510 0.141132 0.144423 0.140610 0.050928 0.093916 0.100292 0.115140 0.094570 0.095145 0.099596 0.097155 0.107556 0.101964
qa: -0.5563 -0.3365 -0.5515 -0.1575 -0.2486 0.1225 0.0635 0.2575 0.1724 -0.3131 -0.3192 -0.0128 -0.2970 0.5053 -0.1403 -0.2170 -0.0174 -0.2233 -0.1676 0.1794 -0.2161 -0.2683 -0.2779 0.1089 0.0626 0.0889 0.1062 0.0854 0.0988 0.1000 0.0994 0.0840 0.1735 0.1808 0.1083 0.1025 0.0900 0.1485 0.1411 0.1444 0.1406 0.0509 0.0939 0.1003 0.1151 0.0946 0.0951 0.0996 0.0972 0.1076 0.1020
va: 1.9508 2.0805 1.9390 3.1944 3.2011 3.7981 3.8499 4.1675 3.7419 3.9474 3.9401 3.6047 3.9643 4.3239 3.9142 3.8852 3.6310 3.9110 3.8595 3.7863 3.8856 3.9317 3.9242 1.0373 1.0161 1.0416 1.0046 1.0092 1.0060 1.0034 1.0025 1.0101 1.0186 1.0199 1.0029 1.0053 1.0010 0.9961 1.0152 1.0007 1.0006 1.0284 1.0042 0.9949 0.9961 1.0074 1.0148 1.0055 1.0038 1.0093 1.0069
dispcorr: -0.030062661 hartree
energy: -1038.183615068397
dipole: 0.30596 -0.74302 -0.43707 5.60778 -4.13628 1.47150 8.99068 -5.73853 3.25216
magnitude: 3.59623 au
magnitude: 9.14088 debye
